{"text_format":"1","workbook":"xlsx","n_sheets":10,"sheets":["Deckblatt","Ablauf","Ausbildung ","Wunschunternehmen","Liste","Qualifikation","Ende","Extrablatt","Kombination","Aufschlüsselung"],"not_rendered":{"charts":0,"images":1,"macros":0,"external_links":0,"defined_names":51,"comments":2,"pivot_tables":0},"unopened":[],"bounds":{"document_bytes":16777216,"sheet_cells":100000,"rows_first":2000,"rows_last":500,"rows_between":2000,"halvings":0,"cell_chars":16384,"cell_head_chars":4096},"cells_cut":0,"cells_raw":0,"read":"whole","date_system":"1900"}

{"sheet":"Deckblatt","index":0,"n_rows":0,"n_cols":0,"rows_kept":0,"cut":false,"hidden":false,"merged":[]}

{"sheet":"Ablauf","index":1,"n_rows":13,"n_cols":4,"rows_kept":13,"cut":false,"hidden":false,"merged":[[4,1,4,2],[9,1,9,2],[12,1,12,2]]}
[]
[]
[]
[]
[null,"Ablauf der \nGehaltsanalyse",null,"Anhand Ihrer Angaben und der uns vorliegenden anonymen Vergleichsdaten unserer Gehaltsdatenbank wird ein Ergebnisbericht „Gehaltsanalyse“ für Sie erstellt.\n"]
[null,null,null,"Ihre Personalien werden ausschließlich zur Einladung zum Feedbackgespräch durch MLP bzw. Ihren  MLP-Berater und zur Personalisierung und Zustellung der Gehaltsanalyse genutzt. Ihre übrigen Angaben werden ausschließlich zum Zwecke der Erhebung und der Verbesserung unserer Vergleichsdaten in der MLP-Gehaltsdatenbank in anonymisierter Form gespeichert.\n"]
[null,null,null,"Ihr Ergebnisbericht wird an den für Sie zuständigen MLP-Berater weitergegeben, damit Ihnen die Ge-haltsanalyse in einem persönlichen Feedbackgespräch erläutert werden kann. Hierzu erhalten Sie eine Einladung von Ihrem MLP-Berater. Sollten Sie noch keinen MLP-Berater haben, so wird Ihnen ein Berater in Ihrer Umgebung zugeordnet werden."]
[]
[]
[null,"Beauftragung der\nGehaltsanalyse",null,"Durch den Rückversand des ausgefüllten Fragebogens erklären Sie sich damit einverstanden, dass MLP Ihnen eine Gehaltsanalyse erstellt und dazu Ihre Angaben wie vorstehend beschrieben nutzt."]
[]
[]
[null,"Bitte beachten Sie",null,"Die Höhe von Gehältern im Allgemeinen und die von Akademikern im Besonderen hängt von zahlreichen Faktoren wie zum Beispiel Studiengang, Branche, Standort, Unternehmensgröße, Tätigkeitsbereich etc. ab. Daher gilt die Regel: Je detaillierter Ihre Angaben sind, desto genauer und individueller kann auch Ihre Gehaltsanalyse sein."]

{"sheet":"Ausbildung ","index":2,"n_rows":45,"n_cols":10,"rows_kept":45,"cut":false,"hidden":false,"merged":[]}
[]
[]
[null,"Person"]
[null,null,"Vorname",null,null,null,"Straße, Hausnummer"]
[]
[null,null,"Nachname",null,null,null,"PLZ, Wohnort"]
[]
[null,null,"Geschlecht",null," - Bitte auswählen -",null,"Tel"]
[]
[null,null,"Geburtsdatum",null,null,null,"E-Mail"]
[]
[]
[null,null,"MLP-Kunde",null," - Bitte auswählen -"]
[]
[]
[]
[]
[]
[null,"Studium"]
[null,null,null,null,null,null,null,null,null,{"$f":"IF(OR(OR(E28=\"\",E28=\" - Bitte auswählen -\"),OR(E32=\"\",E32=\" - Bitte auswählen -\")),\"Pflichtangaben zur Erstellung der Analyse fehlen.\",IF(OR(Wunschunternehmen!D34=\"\",Wunschunternehmen!D34=\" - Bitte auswählen -\",Wunschunternehmen!D36=\"\",Wunschunternehmen!D36=\" - Bitte auswählen -\",Wunschunternehmen!D38=\"\",Wunschunternehmen!D38=\" - Bitte auswählen -\",Wunschunternehmen!D40=\"\",Wunschunternehmen!D40=\" - Bitte auswählen -\",Wunschunternehmen!D42=\"\",Wunschunternehmen!D42=\" - Bitte auswählen -\"),\"Pflichtangaben zur Erstellung der Analyse fehlen.\",\"\"))","v":"Pflichtangaben zur Erstellung der Analyse fehlen."}]
[]
[null,null,"Hochschulart",null," - Bitte auswählen -",null,"(Voraussichtliche) Studiendaueri"]
[null,null,null,null,null,null,"(Bitte die Semesteranzahl angeben)"]
[null,null,"Hochschulort"]
[null,null,null,null,{"$f":"IF(E24=\"\",\"\",IF(ISERROR(VLOOKUP(E24,Aufschlüsselung!BL:BM,2,FALSE)),\"Ist die Rechtschreibung des Hochschulorts korrekt?\",\"\"))","v":""}]
[null,null,"Hochschulname",null,null,null,"(Voraussichtliches) Studienende"]
[null,null,null,null,null,null,"(Bitte das Datum angeben)"]
[null,null,"Fachbereich",null," - Bitte auswählen -"]
[]
[null,null,"Studiengangi",null," - Bitte auswählen -",null,"Abschluss-/Examensnotei"]
[]
[null,null,"(Bevorstehender) höchster ",null," - Bitte auswählen -",null,"Promotionsbewertung",null,"keine"]
[null,null,"akademischer Abschluss"]
[]
[]
[null,null,"Doppel- bzw. Zweitstudium",null,"Nein"]
[]
[]
[]
[null,"Auslandsstudium/"]
[null,"Auslandssemester"]
[null,null,null,null,"Erstes Auslandsstudium",null,"Zweites Auslandsstudium",null,"Drittes Auslandsstudium"]
[null,null,"Semesteranzahl"]
[]
[null,null,"Land",null," - Bitte auswählen -",null," - Bitte auswählen -",null," - Bitte auswählen -"]

{"sheet":"Wunschunternehmen","index":3,"n_rows":64,"n_cols":9,"rows_kept":64,"cut":false,"hidden":false,"merged":[[26,3,26,5],[2,3,2,7]]}
[]
[]
[null,null,null,{"$f":"IF(OR(OR('Ausbildung '!E22=\"\",'Ausbildung '!E22=\" - Bitte auswählen -\"),(OR('Ausbildung '!E28=\"\",'Ausbildung '!E28=\" - Bitte auswählen -\")),(OR('Ausbildung '!E32=\"\",'Ausbildung '!E32=\" - Bitte auswählen -\"))),\"ACHTUNG! Keine Analyse möglich!\"&CHAR(10)&\"Die Hochschulart, der Fachbereich und der Abschluss müssen unbedingt angegeben werden. Bitte überprüfen Sie Ihre Angaben hierzu.\",\"\")","v":"ACHTUNG! Keine Analyse möglich!\nDie Hochschulart, der Fachbereich und der Abschluss müssen unbedingt angegeben werden. Bitte überprüfen Sie Ihre Angaben hierzu."}]
[]
[]
[]
[]
[]
[]
[]
[]
[]
[]
[]
[]
[]
[]
[null,null,"Ihre berufliche ","Bitte folgende Hinweise beim Ausfüllen unbedingt beachten:"]
[null,null,"Zielsetzung"]
[null,null,null,"1. Im ersten Block müssen alle mit * gekennzeichneten Felder ausgefüllt werden. Der Name des Wunschunternehmens ist immer optional. "]
[null,null,null,"2. Jeder weitere angebrochene Block muss vollständig ausgefüllt werden, sonst können Ihre restlichen Angaben in diesem Block nicht berücksichtigt werden."]
[null,null,null,"3. Beim Wunschunternehmen sollten Ihre Angaben (Branche, Standort usw.) so genau wie möglich sein. Unsere Gehaltsempfehlungen werden hierauf basieren. "]
[null,null,null,"4. Achten Sie auf die Reihenfolge beim Ausfüllen. Die Position muss vor dem Tätigkeitsbereich ausgefüllt werden, da dieser von der Position abhängig ist.   "]
[]
[]
[]
[null,null,null,"Einen Überblick über alle Auswahlmöglichkeiten erhalten Sie in der "]
[]
[]
[null,null,null,"1. Wunschunternehmen",null,null,"2. Wunschunternehmen"]
[]
[null,null,"Name"," - Optional -",null,"Name"," - Optional -"]
[]
[null,null,"Branche* i"," - Bitte auswählen -",null,"Branche"," - Bitte auswählen -",null,{"$f":"IF(OR('Ausbildung '!E30=\"Naturwissenschaften allgemein\",,'Ausbildung '!E30=\"Biologie\",'Ausbildung '!E30=\"Chemie\",'Ausbildung '!E30=\"Ernährungswissenschaften\",'Ausbildung '!E30=\"Pharmazie\",'Ausbildung '!E30=\"Physik\"),\"SG_Laborleiter\",\"n_SG_Laborleiter\")","v":"n_SG_Laborleiter"}]
[]
[null,null,"Position* i"," - Bitte auswählen -",null,"Position"," - Bitte auswählen -",null,{"$f":"IF(OR(AND('Ausbildung '!E28=\"Naturwissenschaften\",'Ausbildung '!$E$30=\"Wirtschaftsmathematik\"),AND('Ausbildung '!E28=\"Naturwissenschaften\",'Ausbildung '!$E$30=\"Mathematik\")),CONCATENATE('Ausbildung '!E28,\"PosMathematik_WMathe\"),IF(AND('Ausbildung '!E28=\"Naturwissenschaften\",'Ausbildung '!E32=\"Promotion\",I34=\"SG_Laborleiter\"),CONCATENATE('Ausbildung '!E28,\"PosPromotion\"),IF(AND('Ausbildung '!E28=\"Naturwissenschaften\",'Ausbildung '!$E$30=\"Psychologie\"),CONCATENATE('Ausbildung '!E28,\"PosPsychologie\"),IF(OR(AND('Ausbildung '!E28=\"Ingenieurwissenschaften\",'Ausbildung '!$E$30=\"Architektur\"),AND('Ausbildung '!E28=\"Ingenieurwissenschaften\",'Ausbildung '!$E$30=\"Bauingenieurwesen\")),CONCATENATE('Ausbildung '!E28,\"PosBauleiter\"),CONCATENATE('Ausbildung '!E28,\"Pos\")))))","v":" - Bitte auswählen -Pos"}]
[]
[null,null,"Tätigkeitsbereich*"," - Bitte auswählen -",null,"Tätigkeitsbereich"," - Bitte auswählen -"]
[]
[null,null,"Unternehmensgröße*"," - Bitte auswählen -",null,"Unternehmensgröße"," - Bitte auswählen -"]
[]
[null,null,"Standort* i"," - Bitte auswählen -",null,"Standort"," - Bitte auswählen -"]
[]
[]
[]
[]
[null,null,null,"3. Wunschunternehmen",null,null,"4. Wunschunternehmen"]
[]
[null,null,"Name"," - Optional -",null,"Name"," - Optional -"]
[]
[null,null,"Branche"," - Bitte auswählen -",null,"Branche"," - Bitte auswählen -"]
[]
[null,null,"Position"," - Bitte auswählen -",null,"Position"," - Bitte auswählen -"]
[]
[null,null,"Tätigkeitsbereich"," - Bitte auswählen -",null,"Tätigkeitsbereich"," - Bitte auswählen -"]
[]
[null,null,"Unternehmensgröße"," - Bitte auswählen -",null,"Unternehmensgröße"," - Bitte auswählen -"]
[]
[null,null,"Standort"," - Bitte auswählen -",null,"Standort"," - Bitte auswählen -"]
[]
[]
[]
[null,null,"Ihre Gehaltsvorstellung"]
[null,null,null,"Jahresgesamtvergütung von",null,null,"Jahresgesamtvergütung bis"]

{"sheet":"Liste","index":4,"n_rows":355,"n_cols":24,"rows_kept":355,"cut":false,"hidden":false,"merged":[[233,10,272,10],[274,10,276,10],[277,10,278,10],[208,10,216,10],[218,10,221,10],[222,10,223,10],[224,10,232,10],[101,10,103,10],[105,10,107,10],[108,10,118,10],[119,10,146,10],[147,10,190,10],[192,10,206,10],[27,10,31,10],[33,10,39,10],[40,10,41,10],[42,10,47,10],[49,10,54,10],[56,10,99,10],[184,7,187,7],[188,7,189,7],[190,7,201,7],[202,7,235,7],[237,7,239,7],[240,7,241,7],[87,7,89,7],[90,7,102,7],[103,7,126,7],[127,7,164,7],[166,7,177,7],[179,7,182,7],[156,13,179,13],[180,13,182,13],[183,13,184,13],[17,7,19,7],[22,7,26,7],[28,7,32,7],[33,7,34,7],[35,7,41,7],[43,7,48,7],[49,7,86,7],[351,19,352,19],[353,19,354,19],[17,13,20,13],[22,13,25,13],[27,13,30,13],[32,13,60,13],[62,13,90,13],[92,13,104,13],[105,13,133,13],[135,13,141,13],[284,19,287,19],[288,19,289,19],[290,19,291,19],[292,19,303,19],[304,19,346,19],[348,19,350,19],[158,19,160,19],[161,19,173,19],[174,19,203,19],[204,19,252,19],[254,19,271,19],[273,19,282,19],[311,16,313,16],[314,16,315,16],[16,19,20,19],[23,19,25,19],[28,19,32,19],[34,19,40,19],[41,19,42,19],[43,19,49,19],[51,19,99,19],[101,19,106,19],[230,16,244,16],[246,16,252,16],[254,16,257,16],[258,16,259,16],[260,16,270,16],[271,16,309,16],[233,4,234,4],[40,16,41,16],[42,16,48,16],[50,16,92,16],[94,16,99,16],[100,16,142,16],[144,16,146,16],[147,16,158,16],[159,16,185,16],[186,16,228,16],[174,4,177,4],[179,4,182,4],[183,4,184,4],[185,4,195,4],[196,4,228,4],[230,4,232,4],[261,22,263,22],[264,22,265,22],[266,22,267,22],[42,4,47,4],[48,4,84,4],[85,4,87,4],[88,4,99,4],[100,4,123,4],[124,4,160,4],[162,4,172,4],[154,22,194,22],[196,22,208,22],[210,22,219,22],[221,22,222,22],[223,22,224,22],[225,22,259,22],[13,7,13,8],[38,22,39,22],[32,4,33,4],[34,4,40,4],[16,16,20,16],[23,16,25,16],[27,16,31,16],[33,16,39,16],[16,10,20,10],[23,10,25,10],[131,22,153,22],[13,10,13,11],[13,22,13,23],[13,13,13,14],[13,16,13,17],[13,19,13,20],[107,19,155,19],[144,13,150,13],[151,13,152,13],[153,13,154,13],[188,1,190,1],[191,1,192,1],[16,22,20,22],[23,22,25,22],[27,22,30,22],[32,22,37,22],[41,22,81,22],[83,22,84,22],[85,22,125,22],[128,22,130,22],[76,1,96,1],[97,1,132,1],[134,1,141,1],[143,1,151,1],[153,1,154,1],[155,1,186,1],[36,1,71,1],[17,1,19,1],[21,1,24,1],[26,1,29,1],[30,1,31,1],[73,1,75,1],[13,4,13,5],[13,1,13,2],[34,1,35,1],[17,4,19,4],[21,4,25,4],[27,4,31,4]]}
[]
[null,"                             Folgende Listen enthalten die Kombinationsmöglichkeiten von Positionen und Tätigkeitsbereichen für Ihren Fachbereich.                            "]
[]
[]
[]
[]
[]
[]
[]
[]
[]
[]
[]
[null,"Geistes- und Sozialwissenschaften",null,null,"Informatik",null,null,"Ingenieurwissenschaften",null,null,"Naturwissenschaften",null,null,"Rechtswissenschaften",null,null,"Wirtschaftsinformatik",null,null,"Wirtschaftsingenieurwesen",null,null,"Wirtschaftswissenschaften"]
[null,"Position","Tätigkeitsbereich",null,"Position","Tätigkeitsbereich",null,"Position","Tätigkeitsbereich",null,"Position","Tätigkeitsbereich",null,"Position","Tätigkeitsbereich",null,"Position","Tätigkeitsbereich",null,"Position","Tätigkeitsbereich",null,"Position","Tätigkeitsbereich"]
[null,"Account_Manager","Account Management",null,"Account_Manager","Account Management",null,"Account_Manager","Account Management",null,"Account_Manager","Account Management",null,"Account_Manager","Account Management",null,"Account_Manager","Account Management",null,"Account_Manager","Account Management",null,"Account_Manager","Account Management"]
[null,"Assistent_der_Geschäftsleitung/_des_Vorstands","Assistenz der Geschäftsleitung/ des Vorstands",null,"Assistent_der_Geschäftsleitung/_des_Vorstands","Assistenz der Geschäftsleitung/ des Vorstands",null,"Assistent_der_Geschäftsleitung/_des_Vorstands","Assistenz der Geschäftsleitung/ des Vorstands",null,"Analyst (nur für Mathematiker und Wirtschaftsmathematiker)","Asset Management",null,"Assistent_der_Geschäftsleitung/_des_Vorstands","Assistenz der Geschäftsleitung/ des Vorstands",null,"Analyst","Asset Management",null,"Analyst","Asset Management",null,"Analyst","Asset Management"]
[null,"Associate","Consulting",null,"Associate","Consulting",null,"Associate","Consulting",null,null,"Business Development",null,"Associate","Consulting",null,null,"Business Development",null,null,"Business Development",null,null,"Business Development"]
[null,null,"Finanzwesen",null,null,"Finanzwesen",null,null,"Finanzwesen",null,null,"Controlling",null,null,"Finanzwesen",null,null,"Controlling",null,null,"Controlling",null,null,"Controlling"]
[null,null,"Strategieentwicklung",null,null,"Strategieentwicklung",null,null,"Strategieentwicklung",null,null,"Finanzwesen",null,null,"Recht",null,null,"Finanzwesen",null,null,"Finanzwesen",null,null,"Finanzwesen"]
[null,"Business_Development_Manager","Business Development",null,"Business_Development_Manager","Business Development",null,"Bauleiter (nur für Architekten und Bauingenieure)","Bauleitung",null,null,"Strategieentwicklung",null,null,"Strategieentwicklung",null,null,"Strategieentwicklung",null,null,"Strategieentwicklung",null,null,"Strategieentwicklung"]
[null,"Consultant","Business Development",null,"Consultant","Business Development",null,"Business_Development_Manager","Business Development",null,"Asset_Manager (nur für Mathematiker und Wirtschaftsmathematiker)","Asset Management",null,"Business_Development_Manager","Business Development",null,"Asset_Manager","Asset Management",null,"Asset_Manager","Asset Management",null,"Asset_Manager","Asset Management"]
[null,null,"Consulting",null,null,"Consulting",null,"Consultant","Business Development",null,"Assistent_der_Geschäftsleitung/_des_Vorstands","Assistenz der Geschäftsleitung/ des Vorstands",null,"Consultant","Business Development",null,"Assistent_der_Geschäftsleitung/_des_Vorstands","Assistenz der Geschäftsleitung/ des Vorstands",null,"Assistent_der_Geschäftsleitung/_des_Vorstands","Assistenz der Geschäftsleitung/ des Vorstands",null,"Assistent_der_Geschäftsleitung/_des_Vorstands","Assistenz der Geschäftsleitung/ des Vorstands"]
[null,null,"Finanzwesen",null,null,"Finanzwesen",null,null,"Consulting",null,"Associate","Consulting",null,null,"Consulting",null,"Associate","Consulting",null,"Associate","Consulting",null,"Associate","Consulting"]
[null,null,"Strategieentwicklung",null,null,"IT-Consulting",null,null,"Finanzwesen",null,null,"Finanzwesen",null,null,"Finanzwesen",null,null,"Finanzwesen",null,null,"Finanzwesen",null,null,"Finanzwesen"]
[null,"Content_Manager","Content Management",null,null,"Strategieentwicklung",null,null,"IT-Consulting",null,null,"Strategieentwicklung",null,null,"Strategieentwicklung",null,null,"Strategieentwicklung",null,null,"Strategieentwicklung",null,null,"Strategieentwicklung"]
[null,"Controller","Controlling",null,"Content_Manager","Content Management",null,null,"Strategieentwicklung",null,"Business_Development_Manager","Business Development",null,"Content_Manager","Content Management",null,"Business_Development_Manager","Business Development",null,"Bauleiter","Bauleitung",null,"Business_Development_Manager","Business Development"]
[null,null,"Einkauf und Beschaffung",null,"Controller","Controlling",null,"Content_Manager","Content Management",null,"Consultant","Business Development",null,"Controller","Controlling",null,"Consultant","Business Development",null,"Business_Development_Manager","Business Development",null,"Consultant","Business Development"]
[null,null,"Finanzwesen",null,null,"Einkauf und Beschaffung",null,"Controller","Controlling",null,null,"Consulting",null,null,"Finanzwesen",null,null,"Consulting",null,"Consultant","Business Development",null,null,"Consulting"]
[null,null,"Vertriebssteuerung",null,null,"Finanzwesen",null,null,"Einkauf und Beschaffung",null,null,"Finanzwesen",null,null,"Risikomanagement",null,null,"Finanzwesen",null,null,"Consulting",null,null,"Finanzwesen"]
[null,"Einkäufer","Einkauf und Beschaffung",null,null,"Produktion und Fertigung",null,null,"Finanzwesen",null,null,"IT-Consulting",null,null,"Vertriebssteuerung",null,null,"IT-Consulting",null,null,"Finanzwesen",null,null,"Strategieentwicklung"]
[null,null,"Produktmanagement",null,null,"Vertriebssteuerung",null,null,"Produktion und Fertigung",null,null,"Strategieentwicklung",null,"Justiziar/_Syndikus","Recht",null,null,"Strategieentwicklung",null,null,"IT-Consulting",null,"Content_Manager","Content Management"]
[null,"Event_Manager","Event Management",null,"Einkäufer","Einkauf und Beschaffung",null,null,"Vertriebssteuerung",null,"Content_Manager","Content Management",null,"Kaufmännischer_Angestellter","Account Management",null,"Content_Manager","Content Management",null,null,"Strategieentwicklung",null,"Controller","Controlling"]
[null,"Key_Account_Manager","Key Account Management",null,null,"Produktmanagement",null,"Einkäufer","Einkauf und Beschaffung",null,"Controller","Controlling",null,null,"Allgemeine Verwaltung",null,"Controller","Controlling",null,"Content_Manager","Content Management",null,null,"Einkauf und Beschaffung"]
[null,"Marketing_Assistent","Marketing",null,"Entwickler","Engineering",null,null,"Produktmanagement",null,null,"Einkauf und Beschaffung",null,null,"Assistenz der Geschäftsleitung/ des Vorstands",null,null,"Einkauf und Beschaffung",null,"Controller","Controlling",null,null,"Finanzwesen"]
[null,null,"Online-Marketing",null,null,"Entwicklung",null,"Entwickler","Engineering",null,null,"Finanzwesen",null,null,"Aus- und Weiterbildung",null,null,"Finanzwesen",null,null,"Einkauf und Beschaffung",null,null,"Rechnungswesen"]
[null,"Mitarbeiter","Account Management",null,null,"Forschung und Entwicklung",null,null,"Entwicklung",null,null,"Produktion und Fertigung",null,null,"Business Development",null,null,"Produktion und Fertigung",null,null,"Finanzwesen",null,null,"Risikomanagement"]
[null,null,"Allgemeine Verwaltung",null,null,"Konstruktion",null,null,"Forschung und Entwicklung",null,null,"Rechnungswesen",null,null,"Consulting",null,null,"Rechnungswesen",null,null,"Produktion und Fertigung",null,null,"Vertriebssteuerung"]
[null,null,"Assistenz der Geschäftsleitung/ des Vorstands",null,null,"Mediengestaltung",null,null,"Konstruktion",null,null,"Risikomanagement",null,null,"Content Management",null,null,"Risikomanagement",null,null,"Rechnungswesen",null,"Einkäufer","Einkauf und Beschaffung"]
[null,null,"Aus- und Weiterbildung",null,null,"Projektmanagement",null,null,"Mediengestaltung",null,null,"Vertriebssteuerung",null,null,"Controlling",null,null,"Vertriebssteuerung",null,null,"Risikomanagement",null,null,"Produktmanagement"]
[null,null,"Business Development",null,null,"Softwareentwicklung",null,null,"Projektmanagement",null,"Einkäufer","Einkauf und Beschaffung",null,null,"Finanzwesen",null,"Einkäufer","Einkauf und Beschaffung",null,null,"Vertriebssteuerung",null,"Event_Manager","Event Management"]
[null,null,"Consulting",null,"Key_Account_Manager","Key Account Management",null,null,"Softwareentwicklung",null,null,"Produktmanagement",null,null,"Forschung und Entwicklung",null,null,"Produktmanagement",null,"Einkäufer","Einkauf und Beschaffung",null,"Kaufmännischer_Angestellter","Account Management"]
[null,null,"Content Management",null,"Konstrukteur","Engineering",null,"Key_Account_Manager","Key Account Management",null,"Entwickler","Engineering",null,null,"Key Account Management",null,"Entwickler","Engineering",null,null,"Produktmanagement",null,null,"Allgemeine Verwaltung"]
[null,null,"Controlling",null,null,"Entwicklung",null,"Konstrukteur","Engineering",null,null,"Entwicklung",null,null,"Marketing",null,null,"Entwicklung",null,"Entwickler","Engineering",null,null,"Asset Management"]
[null,null,"Design und Gestaltung",null,null,"Forschung und Entwicklung",null,null,"Entwicklung",null,null,"Forschung und Entwicklung",null,null,"Personalwesen",null,null,"Forschung und Entwicklung",null,null,"Entwicklung",null,null,"Assistenz der Geschäftsleitung/ des Vorstands"]
[null,null,"Einkauf und Beschaffung",null,null,"Konstruktion",null,null,"Forschung und Entwicklung",null,null,"Konstruktion",null,null,"Planung",null,null,"Konstruktion",null,null,"Forschung und Entwicklung",null,null,"Aus- und Weiterbildung"]
[null,null,"Event Management",null,null,"Produktion und Fertigung",null,null,"Konstruktion",null,null,"Projektmanagement",null,null,"Produktmanagement",null,null,"Mediengestaltung",null,null,"Konstruktion",null,null,"Business Development"]
[null,null,"Facility Management",null,null,"Projektmanagement",null,null,"Produktion und Fertigung",null,null,"Softwareentwicklung",null,null,"Projektmanagement",null,null,"Projektmanagement",null,null,"Mediengestaltung",null,null,"Consulting"]
[null,null,"Finanzwesen",null,"Mitarbeiter","Account Management",null,null,"Projektmanagement",null,"Key_Account_Manager","Key Account Management",null,null,"Prozessmanagement",null,null,"Softwareentwicklung",null,null,"Projektmanagement",null,null,"Content Management"]
[null,null,"Forschung und Entwicklung",null,null,"Allgemeine Verwaltung",null,"Mitarbeiter","Account Management",null,"Konstrukteur","Engineering",null,null,"Public Relation und Unternehmenskommunikation",null,"Event_Manager","Event Management",null,null,"Softwareentwicklung",null,null,"Controlling"]
[null,null,"Gesundheitsmanagement",null,null,"Assistenz der Geschäftsleitung/ des Vorstands",null,null,"Allgemeine Verwaltung",null,null,"Entwicklung",null,null,"Recht",null,"Kaufmännischer_Angestellter","Account Management",null,"Event_Manager","Event Management",null,null,"Einkauf und Beschaffung"]
[null,null,"Key Account Management",null,null,"Aus- und Weiterbildung",null,null,"Assistenz der Geschäftsleitung/ des Vorstands",null,null,"Forschung und Entwicklung",null,null,"Redaktion",null,null,"Allgemeine Verwaltung",null,"Kaufmännischer_Angestellter","Account Management",null,null,"Event Management"]
[null,null,"Logistik",null,null,"Business Development",null,null,"Aus- und Weiterbildung",null,null,"Konstruktion",null,null,"Risikomanagement",null,null,"Asset Management",null,null,"Allgemeine Verwaltung",null,null,"Facility Management"]
[null,null,"Marketing",null,null,"Consulting",null,null,"Bauleitung",null,null,"Produktion und Fertigung",null,null,"Steuer- und Wirtschaftsprüfung",null,null,"Assistenz der Geschäftsleitung/ des Vorstands",null,null,"Asset Management",null,null,"Finanzwesen"]
[null,null,"Marktforschung",null,null,"Content Management",null,null,"Business Development",null,null,"Projektmanagement",null,null,"Strategieentwicklung",null,null,"Aus- und Weiterbildung",null,null,"Assistenz der Geschäftsleitung/ des Vorstands",null,null,"Forschung und Entwicklung"]
[null,null,"Online-Marketing",null,null,"Controlling",null,null,"Consulting",null,"Laborleiter (nur mit Promotion)","Forschung und Entwicklung",null,null,"Strategisches Produktmanagement",null,null,"Business Development",null,null,"Aus- und Weiterbildung",null,null,"Gesundheitsmanagement"]
[null,null,"Personalwesen",null,null,"Design und Gestaltung",null,null,"Content Management",null,"Mitarbeiter","Account Management",null,null,"Unternehmenskommunikation und Public Relation",null,null,"Consulting",null,null,"Bauleitung",null,null,"Key Account Management"]
[null,null,"Planung",null,null,"Einkauf und Beschaffung",null,null,"Controlling",null,null,"Allgemeine Verwaltung",null,null,"Vertrieb-Außendienst",null,null,"Content Management",null,null,"Business Development",null,null,"Logistik"]
[null,null,"Produktmanagement",null,null,"Engineering",null,null,"Design und Gestaltung",null,null,"Asset Management",null,null,"Vertrieb-Innendienst",null,null,"Controlling",null,null,"Consulting",null,null,"Marketing"]
[null,null,"Projektmanagement",null,null,"Entwicklung",null,null,"Einkauf und Beschaffung",null,null,"Assistenz der Geschäftsleitung/ des Vorstands",null,null,"Vertriebssteuerung",null,null,"Design und Gestaltung",null,null,"Content Management",null,null,"Marktforschung"]
[null,null,"Prozessmanagement",null,null,"Facility Management",null,null,"Engineering",null,null,"Aus- und Weiterbildung",null,null,"Wirtschafts- und Steuerprüfung",null,null,"Einkauf und Beschaffung",null,null,"Controlling",null,null,"Mediengestaltung"]
[null,null,"Public Relation und Unternehmenskommunikation",null,null,"Finanzwesen",null,null,"Entwicklung",null,null,"Business Development",null,"Key_Account_Manager","Key Account Management",null,null,"Engineering",null,null,"Design und Gestaltung",null,null,"Online-Marketing"]
[null,null,"Qualitätswesen",null,null,"Forschung und Entwicklung",null,null,"Facility Management",null,null,"Consulting",null,"Mitarbeiter","Account Management",null,null,"Entwicklung",null,null,"Einkauf und Beschaffung",null,null,"Personalwesen"]
[null,null,"Redaktion",null,null,"IT",null,null,"Finanzwesen",null,null,"Content Management",null,null,"Allgemeine Verwaltung",null,null,"Event Management",null,null,"Engineering",null,null,"Planung"]
[null,null,"Sozialwesen",null,null,"IT-Consulting",null,null,"Forschung und Entwicklung",null,null,"Controlling",null,null,"Assistenz der Geschäftsleitung/ des Vorstands",null,null,"Facility Management",null,null,"Entwicklung",null,null,"Portfoliomanagement"]
[null,null,"Strategieentwicklung",null,null,"Key Account Management",null,null,"IT",null,null,"Einkauf und Beschaffung",null,null,"Aus- und Weiterbildung",null,null,"Finanzwesen",null,null,"Event Management",null,null,"Produktmanagement"]
[null,null,"Strategisches Produktmanagement",null,null,"Konstruktion",null,null,"IT-Consulting",null,null,"Engineering",null,null,"Business Development",null,null,"Forschung und Entwicklung",null,null,"Facility Management",null,null,"Projektmanagement"]
[null,null,"Therapie",null,null,"Logistik",null,null,"Key Account Management",null,null,"Entwicklung",null,null,"Consulting",null,null,"Gesundheitsmanagement",null,null,"Finanzwesen",null,null,"Prozessmanagement"]
[null,null,"Unternehmenskommunikation und Public Relation",null,null,"Marketing",null,null,"Konstruktion",null,null,"Finanzwesen",null,null,"Content Management",null,null,"IT",null,null,"Forschung und Entwicklung",null,null,"Public Relation und Unternehmenskommunikation"]
[null,null,"Vertrieb-Außendienst",null,null,"Marktforschung",null,null,"Logistik",null,null,"Forschung und Entwicklung",null,null,"Controlling",null,null,"IT-Consulting",null,null,"Gesundheitsmanagement",null,null,"Qualitätswesen"]
[null,null,"Vertrieb-Innendienst",null,null,"Mediengestaltung",null,null,"Marketing",null,null,"Gesundheitsmanagement",null,null,"Finanzwesen",null,null,"Key Account Management",null,null,"IT",null,null,"Rechnungswesen"]
[null,null,"Vertriebssteuerung",null,null,"Online-Marketing",null,null,"Marktforschung",null,null,"IT",null,null,"Forschung und Entwicklung",null,null,"Konstruktion",null,null,"IT-Consulting",null,null,"Redaktion"]
[null,"Personalreferent","Personalwesen",null,null,"Planung",null,null,"Mediengestaltung",null,null,"IT-Consulting",null,null,"Key Account Management",null,null,"Logistik",null,null,"Key Account Management",null,null,"Risikomanagement"]
[null,"Produkt_Manager","Einkauf und Beschaffung",null,null,"Produktion und Fertigung",null,null,"Online-Marketing",null,null,"Key Account Management",null,null,"Marketing",null,null,"Marketing",null,null,"Konstruktion",null,null,"Sozialwesen"]
[null,null,"Produktmanagement",null,null,"Produktmanagement",null,null,"Planung",null,null,"Konstruktion",null,null,"Personalwesen",null,null,"Marktforschung",null,null,"Logistik",null,null,"Steuer- und Wirtschaftsprüfung"]
[null,null,"Strategisches Produktmanagement",null,null,"Projektmanagement",null,null,"Produktion und Fertigung",null,null,"Logistik",null,null,"Planung",null,null,"Mediengestaltung",null,null,"Marketing",null,null,"Strategieentwicklung"]
[null,"Projektleiter/_Projektmanager","Aus- und Weiterbildung",null,null,"Prozessmanagement",null,null,"Produktmanagement",null,null,"Marketing",null,null,"Produktmanagement",null,null,"Online-Marketing",null,null,"Marktforschung",null,null,"Strategisches Produktmanagement"]
[null,null,"Controlling",null,null,"Qualitätswesen",null,null,"Projektmanagement",null,null,"Marktforschung",null,null,"Projektmanagement",null,null,"Planung",null,null,"Mediengestaltung",null,null,"Unternehmenskommunikation und Public Relation"]
[null,null,"Design und Gestaltung",null,null,"Redaktion",null,null,"Prozessmanagement",null,null,"Online-Marketing",null,null,"Prozessmanagement",null,null,"Portfoliomanagement",null,null,"Online-Marketing",null,null,"Vertrieb-Außendienst"]
[null,null,"Einkauf und Beschaffung",null,null,"Softwareentwicklung",null,null,"Qualitätswesen",null,null,"Personalwesen",null,null,"Public Relation und Unternehmenskommunikation",null,null,"Produktion und Fertigung",null,null,"Personalwesen",null,null,"Vertrieb-Innendienst"]
[null,null,"Facility Management",null,null,"Strategieentwicklung",null,null,"Redaktion",null,null,"Planung",null,null,"Recht",null,null,"Produktmanagement",null,null,"Planung",null,null,"Vertriebssteuerung"]
[null,null,"Finanzwesen",null,null,"Strategisches Produktmanagement",null,null,"Softwareentwicklung",null,null,"Portfoliomanagement",null,null,"Redaktion",null,null,"Projektmanagement",null,null,"Portfoliomanagement",null,null,"Wirtschafts- und Steuerprüfung"]
[null,null,"Forschung und Entwicklung",null,null,"Vertrieb-Außendienst",null,null,"Strategieentwicklung",null,null,"Produktion und Fertigung",null,null,"Risikomanagement",null,null,"Prozessmanagement",null,null,"Produktion und Fertigung",null,"Key_Account_Manager","Key Account Management"]
[null,null,"Gesundheitsmanagement",null,null,"Vertrieb-Innendienst",null,null,"Strategisches Produktmanagement",null,null,"Produktmanagement",null,null,"Steuer- und Wirtschaftsprüfung",null,null,"Qualitätswesen",null,null,"Produktmanagement",null,"Marketing_Assistent","Marketing"]
[null,null,"Logistik",null,null,"Vertriebssteuerung",null,null,"Vertrieb-Außendienst",null,null,"Projektmanagement",null,null,"Strategieentwicklung",null,null,"Rechnungswesen",null,null,"Projektmanagement",null,null,"Online-Marketing"]
[null,null,"Marketing",null,"Produkt_Manager","Einkauf und Beschaffung",null,null,"Vertrieb-Innendienst",null,null,"Prozessmanagement",null,null,"Strategisches Produktmanagement",null,null,"Redaktion",null,null,"Prozessmanagement",null,"Mitarbeiter","Account Management"]
[null,null,"Marktforschung",null,null,"Produktmanagement",null,null,"Vertriebssteuerung",null,null,"Public Relation und Unternehmenskommunikation",null,null,"Unternehmenskommunikation und Public Relation",null,null,"Risikomanagement",null,null,"Public Relation und Unternehmenskommunikation",null,null,"Allgemeine Verwaltung"]
[null,null,"Online-Marketing",null,null,"Strategisches Produktmanagement",null,"Produkt_Manager","Einkauf und Beschaffung",null,null,"Qualitätswesen",null,null,"Vertrieb-Außendienst",null,null,"Softwareentwicklung",null,null,"Qualitätswesen",null,null,"Asset Management"]
[null,null,"Personalwesen",null,"Projektingenieur","Engineering",null,null,"Produktmanagement",null,null,"Rechnungswesen",null,null,"Vertrieb-Innendienst",null,null,"Strategieentwicklung",null,null,"Rechnungswesen",null,null,"Assistenz der Geschäftsleitung/ des Vorstands"]
[null,null,"Planung",null,null,"Entwicklung",null,null,"Strategisches Produktmanagement",null,null,"Redaktion",null,null,"Vertriebssteuerung",null,null,"Strategisches Produktmanagement",null,null,"Redaktion",null,null,"Aus- und Weiterbildung"]
[null,null,"Projektmanagement",null,null,"Facility Management",null,"Projektingenieur","Bauleitung",null,null,"Risikomanagement",null,null,"Wirtschafts- und Steuerprüfung",null,null,"Vertrieb-Außendienst",null,null,"Risikomanagement",null,null,"Business Development"]
[null,null,"Public Relation und Unternehmenskommunikation",null,null,"Forschung und Entwicklung",null,null,"Engineering",null,null,"Softwareentwicklung",null,"Personalreferent","Personalwesen",null,null,"Vertrieb-Innendienst",null,null,"Softwareentwicklung",null,null,"Consulting"]
[null,null,"Qualitätswesen",null,null,"IT",null,null,"Entwicklung",null,null,"Sozialwesen",null,"Projektleiter/_Projektmanager","Aus- und Weiterbildung",null,null,"Vertriebssteuerung",null,null,"Steuer- und Wirtschaftsprüfung",null,null,"Content Management"]
[null,null,"Sozialwesen",null,null,"Konstruktion",null,null,"Facility Management",null,null,"Strategieentwicklung",null,null,"Controlling",null,"Key_Account_Manager","Key Account Management",null,null,"Strategieentwicklung",null,null,"Controlling"]
[null,null,"Unternehmenskommunikation und Public Relation",null,null,"Planung",null,null,"Forschung und Entwicklung",null,null,"Strategisches Produktmanagement",null,null,"Finanzwesen",null,"Konstrukteur","Engineering",null,null,"Strategisches Produktmanagement",null,null,"Einkauf und Beschaffung"]
[null,null,"Vertrieb-Innendienst",null,null,"Produktion und Fertigung",null,null,"IT",null,null,"Therapie",null,null,"Forschung und Entwicklung",null,null,"Entwicklung",null,null,"Unternehmenskommunikation und Public Relation",null,null,"Event Management"]
[null,null,"Vertriebssteuerung",null,null,"Projektmanagement",null,null,"Konstruktion",null,null,"Unternehmenskommunikation und Public Relation",null,null,"Marketing",null,null,"Forschung und Entwicklung",null,null,"Vertrieb-Außendienst",null,null,"Facility Management"]
[null,"Projektmitarbeiter","Account Management",null,null,"Prozessmanagement",null,null,"Planung",null,null,"Vertrieb-Außendienst",null,null,"Personalwesen",null,null,"Konstruktion",null,null,"Vertrieb-Innendienst",null,null,"Finanzwesen"]
[null,null,"Allgemeine Verwaltung",null,null,"Qualitätswesen",null,null,"Produktion und Fertigung",null,null,"Vertrieb-Innendienst",null,null,"Planung",null,null,"Produktion und Fertigung",null,null,"Vertriebssteuerung",null,null,"Forschung und Entwicklung"]
[null,null,"Assistenz der Geschäftsleitung/ des Vorstands",null,null,"Softwareentwicklung",null,null,"Projektmanagement",null,null,"Vertriebssteuerung",null,null,"Projektmanagement",null,null,"Projektmanagement",null,null,"Wirtschafts- und Steuerprüfung",null,null,"Gesundheitsmanagement"]
[null,null,"Aus- und Weiterbildung",null,"Projektleiter/_Projektmanager","Aus- und Weiterbildung",null,null,"Prozessmanagement",null,"Personalreferent (nur für Psychologen)","Personalwesen",null,null,"Public Relation und Unternehmenskommunikation",null,"Mitarbeiter","Account Management",null,"Key_Account_Manager","Key Account Management",null,null,"Key Account Management"]
[null,null,"Business Development",null,null,"Controlling",null,null,"Qualitätswesen",null,"Pharmareferent","Account Management",null,null,"Risikomanagement",null,null,"Allgemeine Verwaltung",null,"Konstrukteur","Engineering",null,null,"Logistik"]
[null,null,"Consulting",null,null,"Design und Gestaltung",null,null,"Softwareentwicklung",null,null,"Key Account Management",null,null,"Unternehmenskommunikation und Public Relation",null,null,"Asset Management",null,null,"Entwicklung",null,null,"Marketing"]
[null,null,"Content Management",null,null,"Einkauf und Beschaffung",null,"Projektleiter/_Projektmanager","Aus- und Weiterbildung",null,null,"Vertrieb-Außendienst",null,null,"Vertrieb-Innendienst",null,null,"Assistenz der Geschäftsleitung/ des Vorstands",null,null,"Forschung und Entwicklung",null,null,"Marktforschung"]
[null,null,"Controlling",null,null,"Engineering",null,null,"Controlling",null,"Portfoliomanager (nur für Mathematiker und Wirtschaftsmathematiker)","Portfoliomanagement",null,null,"Vertriebssteuerung",null,null,"Aus- und Weiterbildung",null,null,"Konstruktion",null,null,"Mediengestaltung"]
[null,null,"Design und Gestaltung",null,null,"Entwicklung",null,null,"Design und Gestaltung",null,"Produkt_Manager","Einkauf und Beschaffung",null,"Projektmitarbeiter","Account Management",null,null,"Business Development",null,null,"Produktion und Fertigung",null,null,"Online-Marketing"]
[null,null,"Einkauf und Beschaffung",null,null,"Facility Management",null,null,"Einkauf und Beschaffung",null,null,"Produktmanagement",null,null,"Allgemeine Verwaltung",null,null,"Consulting",null,null,"Projektmanagement",null,null,"Personalwesen"]
[null,null,"Event Management",null,null,"Finanzwesen",null,null,"Engineering",null,null,"Strategisches Produktmanagement",null,null,"Assistenz der Geschäftsleitung/ des Vorstands",null,null,"Content Management",null,"Mitarbeiter","Account Management",null,null,"Planung"]
[null,null,"Facility Management",null,null,"Forschung und Entwicklung",null,null,"Entwicklung",null,"Projektingenieur","Engineering",null,null,"Aus- und Weiterbildung",null,null,"Controlling",null,null,"Allgemeine Verwaltung",null,null,"Portfoliomanagement"]
[null,null,"Finanzwesen",null,null,"IT",null,null,"Facility Management",null,null,"Entwicklung",null,null,"Business Development",null,null,"Design und Gestaltung",null,null,"Asset Management",null,null,"Produktmanagement"]
[null,null,"Forschung und Entwicklung",null,null,"IT-Consulting",null,null,"Finanzwesen",null,null,"Forschung und Entwicklung",null,null,"Consulting",null,null,"Einkauf und Beschaffung",null,null,"Assistenz der Geschäftsleitung/ des Vorstands",null,null,"Projektmanagement"]
[null,null,"Gesundheitsmanagement",null,null,"Konstruktion",null,null,"Forschung und Entwicklung",null,null,"IT",null,null,"Content Management",null,null,"Engineering",null,null,"Aus- und Weiterbildung",null,null,"Prozessmanagement"]
[null,null,"Key Account Management",null,null,"Logistik",null,null,"IT",null,null,"Konstruktion",null,null,"Controlling",null,null,"Entwicklung",null,null,"Bauleitung",null,null,"Public Relation und Unternehmenskommunikation"]
[null,null,"Logistik",null,null,"Marketing",null,null,"IT-Consulting",null,null,"Planung",null,null,"Finanzwesen",null,null,"Event Management",null,null,"Business Development",null,null,"Qualitätswesen"]
[null,null,"Marketing",null,null,"Marktforschung",null,null,"Konstruktion",null,null,"Produktion und Fertigung",null,null,"Forschung und Entwicklung",null,null,"Facility Management",null,null,"Consulting",null,null,"Rechnungswesen"]
[null,null,"Marktforschung",null,null,"Mediengestaltung",null,null,"Logistik",null,null,"Projektmanagement",null,null,"Key Account Management",null,null,"Finanzwesen",null,null,"Content Management",null,null,"Redaktion"]
[null,null,"Online-Marketing",null,null,"Online-Marketing",null,null,"Marketing",null,null,"Prozessmanagement",null,null,"Marketing",null,null,"Forschung und Entwicklung",null,null,"Controlling",null,null,"Risikomanagement"]
[null,null,"Personalwesen",null,null,"Planung",null,null,"Marktforschung",null,null,"Qualitätswesen",null,null,"Personalwesen",null,null,"Gesundheitsmanagement",null,null,"Design und Gestaltung",null,null,"Sozialwesen"]
[null,null,"Planung",null,null,"Produktion und Fertigung",null,null,"Mediengestaltung",null,null,"Softwareentwicklung",null,null,"Planung",null,null,"IT",null,null,"Einkauf und Beschaffung",null,null,"Steuer- und Wirtschaftsprüfung"]
[null,null,"Produktmanagement",null,null,"Projektmanagement",null,null,"Online-Marketing",null,"Projektleiter/_Projektmanager","Aus- und Weiterbildung",null,null,"Produktmanagement",null,null,"IT-Consulting",null,null,"Engineering",null,null,"Strategieentwicklung"]
[null,null,"Projektmanagement",null,null,"Qualitätswesen",null,null,"Planung",null,null,"Controlling",null,null,"Projektmanagement",null,null,"Key Account Management",null,null,"Entwicklung",null,null,"Strategisches Produktmanagement"]
[null,null,"Prozessmanagement",null,null,"Softwareentwicklung",null,null,"Produktion und Fertigung",null,null,"Einkauf und Beschaffung",null,null,"Prozessmanagement",null,null,"Konstruktion",null,null,"Event Management",null,null,"Unternehmenskommunikation und Public Relation"]
[null,null,"Public Relation und Unternehmenskommunikation",null,null,"Vertrieb-Innendienst",null,null,"Projektmanagement",null,null,"Engineering",null,null,"Public Relation und Unternehmenskommunikation",null,null,"Logistik",null,null,"Facility Management",null,null,"Vertrieb-Außendienst"]
[null,null,"Qualitätswesen",null,null,"Vertriebssteuerung",null,null,"Qualitätswesen",null,null,"Entwicklung",null,null,"Recht",null,null,"Marketing",null,null,"Finanzwesen",null,null,"Vertrieb-Innendienst"]
[null,null,"Redaktion",null,"Projektmitarbeiter","Account Management",null,null,"Softwareentwicklung",null,null,"Finanzwesen",null,null,"Redaktion",null,null,"Marktforschung",null,null,"Forschung und Entwicklung",null,null,"Vertriebssteuerung"]
[null,null,"Sozialwesen",null,null,"Allgemeine Verwaltung",null,null,"Vertrieb-Innendienst",null,null,"Forschung und Entwicklung",null,null,"Risikomanagement",null,null,"Mediengestaltung",null,null,"Gesundheitsmanagement",null,null,"Wirtschafts- und Steuerprüfung"]
[null,null,"Strategieentwicklung",null,null,"Assistenz der Geschäftsleitung/ des Vorstands",null,null,"Vertriebssteuerung",null,null,"Gesundheitsmanagement",null,null,"Steuer- und Wirtschaftsprüfung",null,null,"Online-Marketing",null,null,"IT",null,"Personalreferent","Personalwesen"]
[null,null,"Strategisches Produktmanagement",null,null,"Aus- und Weiterbildung",null,"Projektmitarbeiter","Account Management",null,null,"IT",null,null,"Strategieentwicklung",null,null,"Planung",null,null,"IT-Consulting",null,"Portfoliomanager","Portfoliomanagement"]
[null,null,"Therapie",null,null,"Business Development",null,null,"Allgemeine Verwaltung",null,null,"IT-Consulting",null,null,"Strategisches Produktmanagement",null,null,"Portfoliomanagement",null,null,"Key Account Management",null,"Produkt_Manager","Einkauf und Beschaffung"]
[null,null,"Unternehmenskommunikation und Public Relation",null,null,"Consulting",null,null,"Assistenz der Geschäftsleitung/ des Vorstands",null,null,"Konstruktion",null,null,"Unternehmenskommunikation und Public Relation",null,null,"Produktion und Fertigung",null,null,"Konstruktion",null,null,"Produktmanagement"]
[null,null,"Vertrieb-Außendienst",null,null,"Content Management",null,null,"Aus- und Weiterbildung",null,null,"Logistik",null,null,"Vertrieb-Außendienst",null,null,"Produktmanagement",null,null,"Logistik",null,null,"Strategisches Produktmanagement"]
[null,null,"Vertrieb-Innendienst",null,null,"Controlling",null,null,"Bauleitung",null,null,"Marketing",null,null,"Vertrieb-Innendienst",null,null,"Projektmanagement",null,null,"Marketing",null,"Projektleiter/_Projektmanager","Aus- und Weiterbildung"]
[null,null,"Vertriebssteuerung",null,null,"Design und Gestaltung",null,null,"Business Development",null,null,"Marktforschung",null,null,"Vertriebssteuerung",null,null,"Prozessmanagement",null,null,"Marktforschung",null,null,"Controlling"]
[null,"Prozessmanager","Prozessmanagement",null,null,"Einkauf und Beschaffung",null,null,"Consulting",null,null,"Online-Marketing",null,null,"Wirtschafts- und Steuerprüfung",null,null,"Qualitätswesen",null,null,"Mediengestaltung",null,null,"Einkauf und Beschaffung"]
[null,"Prüfungsassistent","Content Management",null,null,"Engineering",null,null,"Content Management",null,null,"Personalwesen",null,"Prozessmanager","Prozessmanagement",null,null,"Rechnungswesen",null,null,"Online-Marketing",null,null,"Facility Management"]
[null,null,"Controlling",null,null,"Entwicklung",null,null,"Controlling",null,null,"Planung",null,"Prüfungsassistent","Content Management",null,null,"Redaktion",null,null,"Personalwesen",null,null,"Finanzwesen"]
[null,null,"Einkauf und Beschaffung",null,null,"Facility Management",null,null,"Design und Gestaltung",null,null,"Produktion und Fertigung",null,null,"Controlling",null,null,"Risikomanagement",null,null,"Planung",null,null,"Forschung und Entwicklung"]
[null,null,"Finanzwesen",null,null,"Finanzwesen",null,null,"Einkauf und Beschaffung",null,null,"Projektmanagement",null,null,"Finanzwesen",null,null,"Softwareentwicklung",null,null,"Portfoliomanagement",null,null,"Gesundheitsmanagement"]
[null,null,"Gesundheitsmanagement",null,null,"Forschung und Entwicklung",null,null,"Engineering",null,null,"Public Relation und Unternehmenskommunikation",null,null,"Prozessmanagement",null,null,"Strategieentwicklung",null,null,"Produktion und Fertigung",null,null,"Logistik"]
[null,null,"Logistik",null,null,"IT",null,null,"Entwicklung",null,null,"Qualitätswesen",null,null,"Risikomanagement",null,null,"Strategisches Produktmanagement",null,null,"Produktmanagement",null,null,"Marketing"]
[null,null,"Prozessmanagement",null,null,"IT-Consulting",null,null,"Facility Management",null,null,"Rechnungswesen",null,null,"Steuer- und Wirtschaftsprüfung",null,null,"Vertrieb-Außendienst",null,null,"Projektmanagement",null,null,"Marktforschung"]
[null,null,"Qualitätswesen",null,null,"Key Account Management",null,null,"Finanzwesen",null,null,"Risikomanagement",null,null,"Wirtschafts- und Steuerprüfung",null,null,"Vertrieb-Innendienst",null,null,"Prozessmanagement",null,null,"Mediengestaltung"]
[null,"Redakteur","Redaktion",null,null,"Konstruktion",null,null,"Forschung und Entwicklung",null,null,"Softwareentwicklung",null,"Rechtsanwalt","Recht",null,null,"Vertriebssteuerung",null,null,"Public Relation und Unternehmenskommunikation",null,null,"Online-Marketing"]
[null,"Referent","Aus- und Weiterbildung",null,null,"Logistik",null,null,"IT",null,null,"Sozialwesen",null,"Redakteur","Redaktion",null,"Portfoliomanager","Portfoliomanagement",null,null,"Qualitätswesen",null,null,"Personalwesen"]
[null,null,"Controlling",null,null,"Marketing",null,null,"IT-Consulting",null,null,"Unternehmenskommunikation und Public Relation",null,"Referent","Aus- und Weiterbildung",null,"Produkt_Manager","Einkauf und Beschaffung",null,null,"Rechnungswesen",null,null,"Planung"]
[null,null,"Event Management",null,null,"Marktforschung",null,null,"Key Account Management",null,null,"Vertrieb-Innendienst",null,null,"Controlling",null,null,"Produktmanagement",null,null,"Redaktion",null,null,"Projektmanagement"]
[null,null,"Finanzwesen",null,null,"Mediengestaltung",null,null,"Konstruktion",null,null,"Vertriebssteuerung",null,null,"Finanzwesen",null,null,"Strategisches Produktmanagement",null,null,"Risikomanagement",null,null,"Public Relation und Unternehmenskommunikation"]
[null,null,"Gesundheitsmanagement",null,null,"Online-Marketing",null,null,"Logistik",null,"Projektmitarbeiter","Account Management",null,null,"Marketing",null,"Projektingenieur","Engineering",null,null,"Softwareentwicklung",null,null,"Qualitätswesen"]
[null,null,"Marketing",null,null,"Planung",null,null,"Marketing",null,null,"Allgemeine Verwaltung",null,null,"Personalwesen",null,null,"Entwicklung",null,null,"Steuer- und Wirtschaftsprüfung",null,null,"Rechnungswesen"]
[null,null,"Personalwesen",null,null,"Produktion und Fertigung",null,null,"Marktforschung",null,null,"Asset Management",null,null,"Public Relation und Unternehmenskommunikation",null,null,"Facility Management",null,null,"Strategieentwicklung",null,null,"Risikomanagement"]
[null,null,"Public Relation und Unternehmenskommunikation",null,null,"Produktmanagement",null,null,"Mediengestaltung",null,null,"Assistenz der Geschäftsleitung/ des Vorstands",null,null,"Unternehmenskommunikation und Public Relation",null,null,"Forschung und Entwicklung",null,null,"Strategisches Produktmanagement",null,null,"Sozialwesen"]
[null,null,"Unternehmenskommunikation und Public Relation",null,null,"Projektmanagement",null,null,"Online-Marketing",null,null,"Aus- und Weiterbildung",null,"Steuerassistent/_Wirtschaftsprüfungsassistent","Wirtschafts- und Steuerprüfung",null,null,"IT",null,null,"Unternehmenskommunikation und Public Relation",null,null,"Unternehmenskommunikation und Public Relation"]
[null,"Sales_Manager","Vertrieb-Außendienst",null,null,"Prozessmanagement",null,null,"Planung",null,null,"Business Development",null,null,"Steuer- und Wirtschaftsprüfung",null,null,"Konstruktion",null,null,"Vertrieb-Außendienst",null,null,"Vertrieb-Innendienst"]
[null,"Strategie_Consultant","Consulting",null,null,"Qualitätswesen",null,null,"Produktion und Fertigung",null,null,"Consulting",null,"Strategie_Consultant","Consulting",null,null,"Planung",null,null,"Vertrieb-Innendienst",null,null,"Vertriebssteuerung"]
[null,null,"Strategieentwicklung",null,null,"Redaktion",null,null,"Produktmanagement",null,null,"Content Management",null,null,"Strategieentwicklung",null,null,"Produktion und Fertigung",null,null,"Vertriebssteuerung",null,"Projektmitarbeiter","Account Management"]
[null,"Trainee","Account Management",null,null,"Softwareentwicklung",null,null,"Projektmanagement",null,null,"Controlling",null,"Syndikus/_Justiziar","Recht",null,null,"Projektmanagement",null,null,"Wirtschafts- und Steuerprüfung",null,null,"Allgemeine Verwaltung"]
[null,null,"Assistenz der Geschäftsleitung/ des Vorstands",null,null,"Strategieentwicklung",null,null,"Prozessmanagement",null,null,"Einkauf und Beschaffung",null,"Trainee","Account Management",null,null,"Prozessmanagement",null,"Personalreferent","Personalwesen",null,null,"Asset Management"]
[null,null,"Business Development",null,null,"Strategisches Produktmanagement",null,null,"Qualitätswesen",null,null,"Engineering",null,null,"Assistenz der Geschäftsleitung/ des Vorstands",null,null,"Qualitätswesen",null,"Portfoliomanager","Portfoliomanagement",null,null,"Assistenz der Geschäftsleitung/ des Vorstands"]
[null,null,"Consulting",null,null,"Vertrieb-Außendienst",null,null,"Redaktion",null,null,"Entwicklung",null,null,"Business Development",null,null,"Softwareentwicklung",null,"Produkt_Manager","Einkauf und Beschaffung",null,null,"Aus- und Weiterbildung"]
[null,null,"Content Management",null,null,"Vertrieb-Innendienst",null,null,"Softwareentwicklung",null,null,"Finanzwesen",null,null,"Consulting",null,"Projektleiter/_Projektmanager","Aus- und Weiterbildung",null,null,"Produktmanagement",null,null,"Business Development"]
[null,null,"Controlling",null,null,"Vertriebssteuerung",null,null,"Strategieentwicklung",null,null,"Forschung und Entwicklung",null,null,"Content Management",null,null,"Controlling",null,null,"Strategisches Produktmanagement",null,null,"Consulting"]
[null,null,"Design und Gestaltung",null,"Prozessmanager","Prozessmanagement",null,null,"Strategisches Produktmanagement",null,null,"Gesundheitsmanagement",null,null,"Controlling",null,null,"Design und Gestaltung",null,"Projektingenieur","Bauleitung",null,null,"Content Management"]
[null,null,"Einkauf und Beschaffung",null,"Prüfungsassistent","Content Management",null,null,"Vertrieb-Außendienst",null,null,"IT",null,null,"Finanzwesen",null,null,"Einkauf und Beschaffung",null,null,"Engineering",null,null,"Controlling"]
[null,null,"Event Management",null,null,"Controlling",null,null,"Vertrieb-Innendienst",null,null,"IT-Consulting",null,null,"Forschung und Entwicklung",null,null,"Engineering",null,null,"Entwicklung",null,null,"Einkauf und Beschaffung"]
[null,null,"Facility Management",null,null,"Einkauf und Beschaffung",null,null,"Vertriebssteuerung",null,null,"Key Account Management",null,null,"Key Account Management",null,null,"Entwicklung",null,null,"Facility Management",null,null,"Event Management"]
[null,null,"Finanzwesen",null,null,"Engineering",null,"Prozessmanager","Prozessmanagement",null,null,"Konstruktion",null,null,"Marketing",null,null,"Facility Management",null,null,"Forschung und Entwicklung",null,null,"Facility Management"]
[null,null,"Forschung und Entwicklung",null,null,"Entwicklung",null,"Prüfungsassistent","Bauleitung",null,null,"Logistik",null,null,"Personalwesen",null,null,"Finanzwesen",null,null,"IT",null,null,"Finanzwesen"]
[null,null,"Gesundheitsmanagement",null,null,"Finanzwesen",null,null,"Content Management",null,null,"Marketing",null,null,"Produktmanagement",null,null,"Forschung und Entwicklung",null,null,"Konstruktion",null,null,"Forschung und Entwicklung"]
[null,null,"Key Account Management",null,null,"Konstruktion",null,null,"Controlling",null,null,"Marktforschung",null,null,"Projektmanagement",null,null,"Gesundheitsmanagement",null,null,"Planung",null,null,"Gesundheitsmanagement"]
[null,null,"Logistik",null,null,"Logistik",null,null,"Einkauf und Beschaffung",null,null,"Online-Marketing",null,null,"Prozessmanagement",null,null,"IT",null,null,"Produktion und Fertigung",null,null,"Key Account Management"]
[null,null,"Marketing",null,null,"Produktion und Fertigung",null,null,"Engineering",null,null,"Personalwesen",null,null,"Public Relation und Unternehmenskommunikation",null,null,"IT-Consulting",null,null,"Projektmanagement",null,null,"Logistik"]
[null,null,"Marktforschung",null,null,"Prozessmanagement",null,null,"Entwicklung",null,null,"Planung",null,null,"Recht",null,null,"Konstruktion",null,null,"Prozessmanagement",null,null,"Marketing"]
[null,null,"Online-Marketing",null,null,"Qualitätswesen",null,null,"Finanzwesen",null,null,"Portfoliomanagement",null,null,"Redaktion",null,null,"Logistik",null,null,"Qualitätswesen",null,null,"Marktforschung"]
[null,null,"Personalwesen",null,"Redakteur","Redaktion",null,null,"Konstruktion",null,null,"Produktion und Fertigung",null,null,"Risikomanagement",null,null,"Marketing",null,null,"Softwareentwicklung",null,null,"Mediengestaltung"]
[null,null,"Produktmanagement",null,"Referent","Aus- und Weiterbildung",null,null,"Logistik",null,null,"Produktmanagement",null,null,"Strategieentwicklung",null,null,"Marktforschung",null,"Projektleiter/_Projektmanager","Aus- und Weiterbildung",null,null,"Online-Marketing"]
[null,null,"Projektmanagement",null,null,"Controlling",null,null,"Produktion und Fertigung",null,null,"Projektmanagement",null,null,"Strategisches Produktmanagement",null,null,"Mediengestaltung",null,null,"Controlling",null,null,"Personalwesen"]
[null,null,"Prozessmanagement",null,null,"Finanzwesen",null,null,"Prozessmanagement",null,null,"Prozessmanagement",null,null,"Unternehmenskommunikation und Public Relation",null,null,"Online-Marketing",null,null,"Design und Gestaltung",null,null,"Planung"]
[null,null,"Public Relation und Unternehmenskommunikation",null,null,"Marketing",null,null,"Qualitätswesen",null,null,"Public Relation und Unternehmenskommunikation",null,null,"Vertrieb-Außendienst",null,null,"Planung",null,null,"Einkauf und Beschaffung",null,null,"Portfoliomanagement"]
[null,null,"Qualitätswesen",null,"Sales_Manager","Vertrieb-Außendienst",null,"Redakteur","Redaktion",null,null,"Qualitätswesen",null,null,"Vertrieb-Innendienst",null,null,"Produktion und Fertigung",null,null,"Engineering",null,null,"Produktmanagement"]
[null,null,"Redaktion",null,"Softwareentwickler","IT",null,"Referent","Aus- und Weiterbildung",null,null,"Rechnungswesen",null,null,"Vertriebssteuerung",null,null,"Projektmanagement",null,null,"Entwicklung",null,null,"Projektmanagement"]
[null,null,"Sozialwesen",null,null,"IT-Consulting",null,null,"Controlling",null,null,"Redaktion",null,"Vertriebler","Vertrieb-Außendienst",null,null,"Qualitätswesen",null,null,"Facility Management",null,null,"Prozessmanagement"]
[null,null,"Strategieentwicklung",null,null,"Projektmanagement",null,null,"Finanzwesen",null,null,"Risikomanagement",null,null,"Key Account Management",null,null,"Rechnungswesen",null,null,"Finanzwesen",null,null,"Public Relation und Unternehmenskommunikation"]
[null,null,"Strategisches Produktmanagement",null,null,"Softwareentwicklung",null,null,"Marketing",null,null,"Softwareentwicklung",null,null,"Account Management",null,null,"Risikomanagement",null,null,"Forschung und Entwicklung",null,null,"Qualitätswesen"]
[null,null,"Unternehmenskommunikation und Public Relation",null,"Strategie_Consultant","Consulting",null,"Sales_Manager","Vertrieb-Außendienst",null,null,"Sozialwesen",null,"Wirtschaftsprüfungsassistent/_Steuerassistent","Wirtschafts- und Steuerprüfung",null,null,"Softwareentwicklung",null,null,"Gesundheitsmanagement",null,null,"Rechnungswesen"]
[null,null,"Vertrieb-Außendienst",null,null,"Strategieentwicklung",null,"Softwareentwickler","IT",null,null,"Strategieentwicklung",null,null,"Steuer- und Wirtschaftsprüfung",null,null,"Vertrieb-Innendienst",null,null,"IT",null,null,"Redaktion"]
[null,null,"Vertrieb-Innendienst",null,"Technischer_Angestellter","Engineering",null,null,"IT-Consulting",null,null,"Strategisches Produktmanagement",null,"Wissenschaftlicher_Mitarbeiter","Forschung und Entwicklung",null,null,"Vertriebssteuerung",null,null,"IT-Consulting",null,null,"Risikomanagement"]
[null,null,"Vertriebssteuerung",null,null,"Entwicklung",null,null,"Projektmanagement",null,null,"Therapie",null,null,null,null,"Projektmitarbeiter","Account Management",null,null,"Konstruktion",null,null,"Sozialwesen"]
[null,"Trainee_Filialleiter/_Verkaufsleiter","Vertrieb-Außendienst",null,null,"Facility Management",null,null,"Softwareentwicklung",null,null,"Unternehmenskommunikation und Public Relation",null,null,null,null,null,"Allgemeine Verwaltung",null,null,"Logistik",null,null,"Steuer- und Wirtschaftsprüfung"]
[null,"Vertriebler","Vertrieb-Außendienst",null,null,"Forschung und Entwicklung",null,"Strategie_Consultant","Consulting",null,null,"Vertrieb-Außendienst",null,null,null,null,null,"Asset Management",null,null,"Marketing",null,null,"Strategieentwicklung"]
[null,null,"Key Account Management",null,null,"IT",null,null,"Strategieentwicklung",null,null,"Vertrieb-Innendienst",null,null,null,null,null,"Assistenz der Geschäftsleitung/ des Vorstands",null,null,"Marktforschung",null,null,"Strategisches Produktmanagement"]
[null,null,"Account Management",null,null,"Konstruktion",null,"Technischer_Angestellter","Bauleitung",null,null,"Vertriebssteuerung",null,null,null,null,null,"Aus- und Weiterbildung",null,null,"Mediengestaltung",null,null,"Unternehmenskommunikation und Public Relation"]
[null,"Wissenschaftlicher_Mitarbeiter","Forschung und Entwicklung",null,null,"Mediengestaltung",null,null,"Engineering",null,"Prozessmanager","Prozessmanagement",null,null,null,null,null,"Business Development",null,null,"Online-Marketing",null,null,"Vertrieb-Außendienst"]
[null,null,"Marktforschung",null,null,"Planung",null,null,"Entwicklung",null,"Prüfungsassistent","Content Management",null,null,null,null,null,"Consulting",null,null,"Personalwesen",null,null,"Vertrieb-Innendienst"]
[null,null,null,null,null,"Produktion und Fertigung",null,null,"Facility Management",null,null,"Controlling",null,null,null,null,null,"Content Management",null,null,"Planung",null,null,"Vertriebssteuerung"]
[null,null,null,null,null,"Projektmanagement",null,null,"Forschung und Entwicklung",null,null,"Einkauf und Beschaffung",null,null,null,null,null,"Controlling",null,null,"Produktion und Fertigung",null,null,"Wirtschafts- und Steuerprüfung"]
[null,null,null,null,null,"Prozessmanagement",null,null,"IT",null,null,"Engineering",null,null,null,null,null,"Design und Gestaltung",null,null,"Projektmanagement",null,"Prozessmanager","Prozessmanagement"]
[null,null,null,null,"Trainee","Account Management",null,null,"Konstruktion",null,null,"Entwicklung",null,null,null,null,null,"Einkauf und Beschaffung",null,null,"Public Relation und Unternehmenskommunikation",null,"Prüfungsassistent","Content Management"]
[null,null,null,null,null,"Assistenz der Geschäftsleitung/ des Vorstands",null,null,"Mediengestaltung",null,null,"Finanzwesen",null,null,null,null,null,"Engineering",null,null,"Qualitätswesen",null,null,"Controlling"]
[null,null,null,null,null,"Business Development",null,null,"Planung",null,null,"Gesundheitsmanagement",null,null,null,null,null,"Entwicklung",null,null,"Rechnungswesen",null,null,"Einkauf und Beschaffung"]
[null,null,null,null,null,"Consulting",null,null,"Produktion und Fertigung",null,null,"Konstruktion",null,null,null,null,null,"Event Management",null,null,"Risikomanagement",null,null,"Finanzwesen"]
[null,null,null,null,null,"Content Management",null,null,"Projektmanagement",null,null,"Logistik",null,null,null,null,null,"Facility Management",null,null,"Softwareentwicklung",null,null,"Gesundheitsmanagement"]
[null,null,null,null,null,"Controlling",null,null,"Prozessmanagement",null,null,"Portfoliomanagement",null,null,null,null,null,"Finanzwesen",null,null,"Unternehmenskommunikation und Public Relation",null,null,"Logistik"]
[null,null,null,null,null,"Design und Gestaltung",null,"Trainee","Account Management",null,null,"Produktion und Fertigung",null,null,null,null,null,"Forschung und Entwicklung",null,null,"Vertrieb-Innendienst",null,null,"Portfoliomanagement"]
[null,null,null,null,null,"Einkauf und Beschaffung",null,null,"Assistenz der Geschäftsleitung/ des Vorstands",null,null,"Prozessmanagement",null,null,null,null,null,"Gesundheitsmanagement",null,null,"Vertriebssteuerung",null,null,"Prozessmanagement"]
[null,null,null,null,null,"Engineering",null,null,"Bauleitung",null,null,"Qualitätswesen",null,null,null,null,null,"IT",null,"Projektmitarbeiter","Account Management",null,null,"Qualitätswesen"]
[null,null,null,null,null,"Entwicklung",null,null,"Business Development",null,null,"Rechnungswesen",null,null,null,null,null,"IT-Consulting",null,null,"Allgemeine Verwaltung",null,null,"Rechnungswesen"]
[null,null,null,null,null,"Facility Management",null,null,"Consulting",null,null,"Risikomanagement",null,null,null,null,null,"Key Account Management",null,null,"Asset Management",null,null,"Risikomanagement"]
[null,null,null,null,null,"Finanzwesen",null,null,"Content Management",null,"Redakteur","Redaktion",null,null,null,null,null,"Konstruktion",null,null,"Assistenz der Geschäftsleitung/ des Vorstands",null,null,"Steuer- und Wirtschaftsprüfung"]
[null,null,null,null,null,"Forschung und Entwicklung",null,null,"Controlling",null,"Referent","Aus- und Weiterbildung",null,null,null,null,null,"Logistik",null,null,"Aus- und Weiterbildung",null,null,"Wirtschafts- und Steuerprüfung"]
[null,null,null,null,null,"IT",null,null,"Design und Gestaltung",null,null,"Controlling",null,null,null,null,null,"Marketing",null,null,"Bauleitung",null,"Redakteur","Redaktion"]
[null,null,null,null,null,"IT-Consulting",null,null,"Einkauf und Beschaffung",null,null,"Finanzwesen",null,null,null,null,null,"Marktforschung",null,null,"Business Development",null,"Referent","Aus- und Weiterbildung"]
[null,null,null,null,null,"Key Account Management",null,null,"Engineering",null,null,"Gesundheitsmanagement",null,null,null,null,null,"Mediengestaltung",null,null,"Consulting",null,null,"Controlling"]
[null,null,null,null,null,"Konstruktion",null,null,"Entwicklung",null,null,"Marketing",null,null,null,null,null,"Online-Marketing",null,null,"Content Management",null,null,"Event Management"]
[null,null,null,null,null,"Logistik",null,null,"Facility Management",null,null,"Personalwesen",null,null,null,null,null,"Planung",null,null,"Controlling",null,null,"Finanzwesen"]
[null,null,null,null,null,"Marketing",null,null,"Finanzwesen",null,null,"Public Relation und Unternehmenskommunikation",null,null,null,null,null,"Portfoliomanagement",null,null,"Design und Gestaltung",null,null,"Gesundheitsmanagement"]
[null,null,null,null,null,"Marktforschung",null,null,"Forschung und Entwicklung",null,null,"Rechnungswesen",null,null,null,null,null,"Produktion und Fertigung",null,null,"Einkauf und Beschaffung",null,null,"Marketing"]
[null,null,null,null,null,"Online-Marketing",null,null,"IT",null,null,"Unternehmenskommunikation und Public Relation",null,null,null,null,null,"Produktmanagement",null,null,"Engineering",null,null,"Personalwesen"]
[null,null,null,null,null,"Produktion und Fertigung",null,null,"IT-Consulting",null,"Sales_Manager","Vertrieb-Außendienst",null,null,null,null,null,"Projektmanagement",null,null,"Entwicklung",null,null,"Public Relation und Unternehmenskommunikation"]
[null,null,null,null,null,"Produktmanagement",null,null,"Key Account Management",null,"Softwareentwickler","IT",null,null,null,null,null,"Prozessmanagement",null,null,"Event Management",null,null,"Rechnungswesen"]
[null,null,null,null,null,"Projektmanagement",null,null,"Konstruktion",null,null,"IT-Consulting",null,null,null,null,null,"Qualitätswesen",null,null,"Facility Management",null,null,"Unternehmenskommunikation und Public Relation"]
[null,null,null,null,null,"Prozessmanagement",null,null,"Logistik",null,null,"Projektmanagement",null,null,null,null,null,"Rechnungswesen",null,null,"Finanzwesen",null,"Sales_Manager","Vertrieb-Außendienst"]
[null,null,null,null,null,"Qualitätswesen",null,null,"Marketing",null,null,"Softwareentwicklung",null,null,null,null,null,"Redaktion",null,null,"Forschung und Entwicklung",null,"Steuerassistent/_Wirtschaftsprüfungsassistent","Wirtschafts- und Steuerprüfung"]
[null,null,null,null,null,"Redaktion",null,null,"Marktforschung",null,"Strategie_Consultant","Consulting",null,null,null,null,null,"Risikomanagement",null,null,"Gesundheitsmanagement",null,null,"Steuer- und Wirtschaftsprüfung"]
[null,null,null,null,null,"Softwareentwicklung",null,null,"Online-Marketing",null,null,"Strategieentwicklung",null,null,null,null,null,"Softwareentwicklung",null,null,"IT",null,"Strategie_Consultant","Consulting"]
[null,null,null,null,null,"Strategieentwicklung",null,null,"Produktion und Fertigung",null,"Technischer_Angestellter","Engineering",null,null,null,null,null,"Strategieentwicklung",null,null,"IT-Consulting",null,null,"Strategieentwicklung"]
[null,null,null,null,null,"Strategisches Produktmanagement",null,null,"Produktmanagement",null,null,"Entwicklung",null,null,null,null,null,"Strategisches Produktmanagement",null,null,"Key Account Management",null,"Trainee","Account Management"]
[null,null,null,null,null,"Vertrieb-Außendienst",null,null,"Projektmanagement",null,null,"Forschung und Entwicklung",null,null,null,null,null,"Vertrieb-Außendienst",null,null,"Konstruktion",null,null,"Asset Management"]
[null,null,null,null,null,"Vertrieb-Innendienst",null,null,"Prozessmanagement",null,null,"IT",null,null,null,null,null,"Vertrieb-Innendienst",null,null,"Logistik",null,null,"Assistenz der Geschäftsleitung/ des Vorstands"]
[null,null,null,null,null,"Vertriebssteuerung",null,null,"Qualitätswesen",null,null,"Konstruktion",null,null,null,null,null,"Vertriebssteuerung",null,null,"Marketing",null,null,"Business Development"]
[null,null,null,null,"Trainee_Filialleiter/_Verkaufsleiter","Vertrieb-Außendienst",null,null,"Redaktion",null,null,"Planung",null,null,null,null,"Prozessmanager","Prozessmanagement",null,null,"Marktforschung",null,null,"Consulting"]
[null,null,null,null,"Vertriebler","Vertrieb-Außendienst",null,null,"Softwareentwicklung",null,null,"Produktion und Fertigung",null,null,null,null,"Prüfungsassistent","Content Management",null,null,"Mediengestaltung",null,null,"Content Management"]
[null,null,null,null,null,"Key Account Management",null,null,"Strategieentwicklung",null,null,"Projektmanagement",null,null,null,null,null,"Controlling",null,null,"Online-Marketing",null,null,"Controlling"]
[null,null,null,null,null,"Account Management",null,null,"Strategisches Produktmanagement",null,null,"Prozessmanagement",null,null,null,null,null,"Einkauf und Beschaffung",null,null,"Personalwesen",null,null,"Einkauf und Beschaffung"]
[null,null,null,null,"Wissenschaftlicher_Mitarbeiter","Forschung und Entwicklung",null,null,"Vertrieb-Außendienst",null,"Trainee","Account Management",null,null,null,null,null,"Engineering",null,null,"Planung",null,null,"Event Management"]
[null,null,null,null,null,"Marktforschung",null,null,"Vertrieb-Innendienst",null,null,"Asset Management",null,null,null,null,null,"Entwicklung",null,null,"Portfoliomanagement",null,null,"Facility Management"]
[null,null,null,null,null,null,null,null,"Vertriebssteuerung",null,null,"Assistenz der Geschäftsleitung/ des Vorstands",null,null,null,null,null,"Finanzwesen",null,null,"Produktion und Fertigung",null,null,"Finanzwesen"]
[null,null,null,null,null,null,null,"Trainee_Filialleiter/_Verkaufsleiter","Vertrieb-Außendienst",null,null,"Business Development",null,null,null,null,null,"Gesundheitsmanagement",null,null,"Produktmanagement",null,null,"Forschung und Entwicklung"]
[null,null,null,null,null,null,null,"Vertriebler","Vertrieb-Außendienst",null,null,"Consulting",null,null,null,null,null,"Konstruktion",null,null,"Projektmanagement",null,null,"Gesundheitsmanagement"]
[null,null,null,null,null,null,null,null,"Key Account Management",null,null,"Content Management",null,null,null,null,null,"Logistik",null,null,"Prozessmanagement",null,null,"Key Account Management"]
[null,null,null,null,null,null,null,null,"Account Management",null,null,"Controlling",null,null,null,null,null,"Portfoliomanagement",null,null,"Public Relation und Unternehmenskommunikation",null,null,"Logistik"]
[null,null,null,null,null,null,null,"Wissenschaftlicher_Mitarbeiter","Forschung und Entwicklung",null,null,"Einkauf und Beschaffung",null,null,null,null,null,"Produktion und Fertigung",null,null,"Qualitätswesen",null,null,"Marketing"]
[null,null,null,null,null,null,null,null,"Marktforschung",null,null,"Engineering",null,null,null,null,null,"Prozessmanagement",null,null,"Rechnungswesen",null,null,"Marktforschung"]
[null,null,null,null,null,null,null,null,null,null,null,"Entwicklung",null,null,null,null,null,"Qualitätswesen",null,null,"Redaktion",null,null,"Online-Marketing"]
[null,null,null,null,null,null,null,null,null,null,null,"Finanzwesen",null,null,null,null,null,"Rechnungswesen",null,null,"Risikomanagement",null,null,"Personalwesen"]
[null,null,null,null,null,null,null,null,null,null,null,"Forschung und Entwicklung",null,null,null,null,null,"Risikomanagement",null,null,"Softwareentwicklung",null,null,"Portfoliomanagement"]
[null,null,null,null,null,null,null,null,null,null,null,"Gesundheitsmanagement",null,null,null,null,"Redakteur","Redaktion",null,null,"Steuer- und Wirtschaftsprüfung",null,null,"Produktmanagement"]
[null,null,null,null,null,null,null,null,null,null,null,"IT",null,null,null,null,"Referent","Aus- und Weiterbildung",null,null,"Strategieentwicklung",null,null,"Projektmanagement"]
[null,null,null,null,null,null,null,null,null,null,null,"IT-Consulting",null,null,null,null,null,"Controlling",null,null,"Strategisches Produktmanagement",null,null,"Prozessmanagement"]
[null,null,null,null,null,null,null,null,null,null,null,"Key Account Management",null,null,null,null,null,"Event Management",null,null,"Unternehmenskommunikation und Public Relation",null,null,"Public Relation und Unternehmenskommunikation"]
[null,null,null,null,null,null,null,null,null,null,null,"Konstruktion",null,null,null,null,null,"Finanzwesen",null,null,"Vertrieb-Außendienst",null,null,"Qualitätswesen"]
[null,null,null,null,null,null,null,null,null,null,null,"Logistik",null,null,null,null,null,"Gesundheitsmanagement",null,null,"Vertrieb-Innendienst",null,null,"Rechnungswesen"]
[null,null,null,null,null,null,null,null,null,null,null,"Marketing",null,null,null,null,null,"Marketing",null,null,"Vertriebssteuerung",null,null,"Redaktion"]
[null,null,null,null,null,null,null,null,null,null,null,"Marktforschung",null,null,null,null,null,"Rechnungswesen",null,null,"Wirtschafts- und Steuerprüfung",null,null,"Risikomanagement"]
[null,null,null,null,null,null,null,null,null,null,null,"Online-Marketing",null,null,null,null,"Sales_Manager","Vertrieb-Außendienst",null,"Prozessmanager","Prozessmanagement",null,null,"Sozialwesen"]
[null,null,null,null,null,null,null,null,null,null,null,"Personalwesen",null,null,null,null,"Softwareentwickler","IT",null,"Prüfungsassistent","Bauleitung",null,null,"Strategieentwicklung"]
[null,null,null,null,null,null,null,null,null,null,null,"Portfoliomanagement",null,null,null,null,null,"IT-Consulting",null,null,"Content Management",null,null,"Strategisches Produktmanagement"]
[null,null,null,null,null,null,null,null,null,null,null,"Produktion und Fertigung",null,null,null,null,null,"Projektmanagement",null,null,"Controlling",null,null,"Unternehmenskommunikation und Public Relation"]
[null,null,null,null,null,null,null,null,null,null,null,"Produktmanagement",null,null,null,null,null,"Softwareentwicklung",null,null,"Einkauf und Beschaffung",null,null,"Vertrieb-Außendienst"]
[null,null,null,null,null,null,null,null,null,null,null,"Projektmanagement",null,null,null,null,"Strategie_Consultant","Consulting",null,null,"Engineering",null,null,"Vertrieb-Innendienst"]
[null,null,null,null,null,null,null,null,null,null,null,"Prozessmanagement",null,null,null,null,null,"Strategieentwicklung",null,null,"Entwicklung",null,null,"Vertriebssteuerung"]
[null,null,null,null,null,null,null,null,null,null,null,"Public Relation und Unternehmenskommunikation",null,null,null,null,"Technischer_Angestellter","Engineering",null,null,"Finanzwesen",null,"Trainee_Filialleiter/_Verkaufsleiter","Vertrieb-Außendienst"]
[null,null,null,null,null,null,null,null,null,null,null,"Qualitätswesen",null,null,null,null,null,"Entwicklung",null,null,"Gesundheitsmanagement",null,"Vertriebler","Vertrieb-Außendienst"]
[null,null,null,null,null,null,null,null,null,null,null,"Rechnungswesen",null,null,null,null,null,"Facility Management",null,null,"Konstruktion",null,null,"Key Account Management"]
[null,null,null,null,null,null,null,null,null,null,null,"Redaktion",null,null,null,null,null,"Forschung und Entwicklung",null,null,"Logistik",null,null,"Account Management"]
[null,null,null,null,null,null,null,null,null,null,null,"Risikomanagement",null,null,null,null,null,"IT",null,null,"Portfoliomanagement",null,"Wirtschaftsprüfungsassistent/_Steuerassistent","Wirtschafts- und Steuerprüfung"]
[null,null,null,null,null,null,null,null,null,null,null,"Softwareentwicklung",null,null,null,null,null,"Konstruktion",null,null,"Produktion und Fertigung",null,null,"Steuer- und Wirtschaftsprüfung"]
[null,null,null,null,null,null,null,null,null,null,null,"Sozialwesen",null,null,null,null,null,"Mediengestaltung",null,null,"Prozessmanagement",null,"Wissenschaftlicher_Mitarbeiter","Forschung und Entwicklung"]
[null,null,null,null,null,null,null,null,null,null,null,"Strategieentwicklung",null,null,null,null,null,"Planung",null,null,"Qualitätswesen",null,null,"Marktforschung"]
[null,null,null,null,null,null,null,null,null,null,null,"Strategisches Produktmanagement",null,null,null,null,null,"Produktion und Fertigung",null,null,"Rechnungswesen"]
[null,null,null,null,null,null,null,null,null,null,null,"Unternehmenskommunikation und Public Relation",null,null,null,null,null,"Projektmanagement",null,null,"Risikomanagement"]
[null,null,null,null,null,null,null,null,null,null,null,"Vertrieb-Außendienst",null,null,null,null,null,"Prozessmanagement",null,null,"Steuer- und Wirtschaftsprüfung"]
[null,null,null,null,null,null,null,null,null,null,null,"Vertrieb-Innendienst",null,null,null,null,"Trainee","Account Management",null,null,"Wirtschafts- und Steuerprüfung"]
[null,null,null,null,null,null,null,null,null,null,null,"Vertriebssteuerung",null,null,null,null,null,"Asset Management",null,"Redakteur","Redaktion"]
[null,null,null,null,null,null,null,null,null,null,"Trainee_Filialleiter/_Verkaufsleiter","Vertrieb-Außendienst",null,null,null,null,null,"Assistenz der Geschäftsleitung/ des Vorstands",null,"Referent","Aus- und Weiterbildung"]
[null,null,null,null,null,null,null,null,null,null,"Vertriebler","Vertrieb-Außendienst",null,null,null,null,null,"Business Development",null,null,"Controlling"]
[null,null,null,null,null,null,null,null,null,null,null,"Key Account Management",null,null,null,null,null,"Consulting",null,null,"Event Management"]
[null,null,null,null,null,null,null,null,null,null,null,"Account Management",null,null,null,null,null,"Content Management",null,null,"Finanzwesen"]
[null,null,null,null,null,null,null,null,null,null,"Wissenschaftlicher_Mitarbeiter","Forschung und Entwicklung",null,null,null,null,null,"Controlling",null,null,"Gesundheitsmanagement"]
[null,null,null,null,null,null,null,null,null,null,null,"Marktforschung",null,null,null,null,null,"Design und Gestaltung",null,null,"Marketing"]
[null,null,null,null,null,null,null,null,null,null,null,null,null,null,null,null,null,"Einkauf und Beschaffung",null,null,"Personalwesen"]
[null,null,null,null,null,null,null,null,null,null,null,null,null,null,null,null,null,"Engineering",null,null,"Public Relation und Unternehmenskommunikation"]
[null,null,null,null,null,null,null,null,null,null,null,null,null,null,null,null,null,"Entwicklung",null,null,"Rechnungswesen"]
[null,null,null,null,null,null,null,null,null,null,null,null,null,null,null,null,null,"Event Management",null,null,"Unternehmenskommunikation und Public Relation"]
[null,null,null,null,null,null,null,null,null,null,null,null,null,null,null,null,null,"Facility Management",null,"Sales_Manager","Vertrieb-Außendienst"]
[null,null,null,null,null,null,null,null,null,null,null,null,null,null,null,null,null,"Finanzwesen",null,"Softwareentwickler","IT"]
[null,null,null,null,null,null,null,null,null,null,null,null,null,null,null,null,null,"Forschung und Entwicklung",null,null,"IT-Consulting"]
[null,null,null,null,null,null,null,null,null,null,null,null,null,null,null,null,null,"Gesundheitsmanagement",null,null,"Projektmanagement"]
[null,null,null,null,null,null,null,null,null,null,null,null,null,null,null,null,null,"IT",null,null,"Softwareentwicklung"]
[null,null,null,null,null,null,null,null,null,null,null,null,null,null,null,null,null,"IT-Consulting",null,"Steuerassistent/_Wirtschaftsprüfungsassistent","Wirtschafts- und Steuerprüfung"]
[null,null,null,null,null,null,null,null,null,null,null,null,null,null,null,null,null,"Key Account Management",null,null,"Steuer- und Wirtschaftsprüfung"]
[null,null,null,null,null,null,null,null,null,null,null,null,null,null,null,null,null,"Konstruktion",null,"Strategie_Consultant","Consulting"]
[null,null,null,null,null,null,null,null,null,null,null,null,null,null,null,null,null,"Logistik",null,null,"Strategieentwicklung"]
[null,null,null,null,null,null,null,null,null,null,null,null,null,null,null,null,null,"Marketing",null,"Technischer_Angestellter","Bauleitung"]
[null,null,null,null,null,null,null,null,null,null,null,null,null,null,null,null,null,"Marktforschung",null,null,"Engineering"]
[null,null,null,null,null,null,null,null,null,null,null,null,null,null,null,null,null,"Online-Marketing",null,null,"Entwicklung"]
[null,null,null,null,null,null,null,null,null,null,null,null,null,null,null,null,null,"Portfoliomanagement",null,null,"Facility Management"]
[null,null,null,null,null,null,null,null,null,null,null,null,null,null,null,null,null,"Produktion und Fertigung",null,null,"Forschung und Entwicklung"]
[null,null,null,null,null,null,null,null,null,null,null,null,null,null,null,null,null,"Produktmanagement",null,null,"IT"]
[null,null,null,null,null,null,null,null,null,null,null,null,null,null,null,null,null,"Projektmanagement",null,null,"Konstruktion"]
[null,null,null,null,null,null,null,null,null,null,null,null,null,null,null,null,null,"Prozessmanagement",null,null,"Mediengestaltung"]
[null,null,null,null,null,null,null,null,null,null,null,null,null,null,null,null,null,"Qualitätswesen",null,null,"Planung"]
[null,null,null,null,null,null,null,null,null,null,null,null,null,null,null,null,null,"Rechnungswesen",null,null,"Produktion und Fertigung"]
[null,null,null,null,null,null,null,null,null,null,null,null,null,null,null,null,null,"Redaktion",null,null,"Projektmanagement"]
[null,null,null,null,null,null,null,null,null,null,null,null,null,null,null,null,null,"Risikomanagement",null,null,"Prozessmanagement"]
[null,null,null,null,null,null,null,null,null,null,null,null,null,null,null,null,null,"Softwareentwicklung",null,"Trainee","Account Management"]
[null,null,null,null,null,null,null,null,null,null,null,null,null,null,null,null,null,"Strategieentwicklung",null,null,"Asset Management"]
[null,null,null,null,null,null,null,null,null,null,null,null,null,null,null,null,null,"Strategisches Produktmanagement",null,null,"Assistenz der Geschäftsleitung/ des Vorstands"]
[null,null,null,null,null,null,null,null,null,null,null,null,null,null,null,null,null,"Vertrieb-Außendienst",null,null,"Bauleitung"]
[null,null,null,null,null,null,null,null,null,null,null,null,null,null,null,null,null,"Vertrieb-Innendienst",null,null,"Business Development"]
[null,null,null,null,null,null,null,null,null,null,null,null,null,null,null,null,null,"Vertriebssteuerung",null,null,"Consulting"]
[null,null,null,null,null,null,null,null,null,null,null,null,null,null,null,null,"Trainee_Filialleiter/_Verkaufsleiter","Vertrieb-Außendienst",null,null,"Content Management"]
[null,null,null,null,null,null,null,null,null,null,null,null,null,null,null,null,"Vertriebler","Vertrieb-Außendienst",null,null,"Controlling"]
[null,null,null,null,null,null,null,null,null,null,null,null,null,null,null,null,null,"Key Account Management",null,null,"Design und Gestaltung"]
[null,null,null,null,null,null,null,null,null,null,null,null,null,null,null,null,null,"Account Management",null,null,"Einkauf und Beschaffung"]
[null,null,null,null,null,null,null,null,null,null,null,null,null,null,null,null,"Wissenschaftlicher_Mitarbeiter","Forschung und Entwicklung",null,null,"Engineering"]
[null,null,null,null,null,null,null,null,null,null,null,null,null,null,null,null,null,"Marktforschung",null,null,"Entwicklung"]
[null,null,null,null,null,null,null,null,null,null,null,null,null,null,null,null,null,null,null,null,"Event Management"]
[null,null,null,null,null,null,null,null,null,null,null,null,null,null,null,null,null,null,null,null,"Facility Management"]
[null,null,null,null,null,null,null,null,null,null,null,null,null,null,null,null,null,null,null,null,"Finanzwesen"]
[null,null,null,null,null,null,null,null,null,null,null,null,null,null,null,null,null,null,null,null,"Forschung und Entwicklung"]
[null,null,null,null,null,null,null,null,null,null,null,null,null,null,null,null,null,null,null,null,"Gesundheitsmanagement"]
[null,null,null,null,null,null,null,null,null,null,null,null,null,null,null,null,null,null,null,null,"IT"]
[null,null,null,null,null,null,null,null,null,null,null,null,null,null,null,null,null,null,null,null,"IT-Consulting"]
[null,null,null,null,null,null,null,null,null,null,null,null,null,null,null,null,null,null,null,null,"Key Account Management"]
[null,null,null,null,null,null,null,null,null,null,null,null,null,null,null,null,null,null,null,null,"Konstruktion"]
[null,null,null,null,null,null,null,null,null,null,null,null,null,null,null,null,null,null,null,null,"Logistik"]
[null,null,null,null,null,null,null,null,null,null,null,null,null,null,null,null,null,null,null,null,"Marketing"]
[null,null,null,null,null,null,null,null,null,null,null,null,null,null,null,null,null,null,null,null,"Marktforschung"]
[null,null,null,null,null,null,null,null,null,null,null,null,null,null,null,null,null,null,null,null,"Online-Marketing"]
[null,null,null,null,null,null,null,null,null,null,null,null,null,null,null,null,null,null,null,null,"Personalwesen"]
[null,null,null,null,null,null,null,null,null,null,null,null,null,null,null,null,null,null,null,null,"Portfoliomanagement"]
[null,null,null,null,null,null,null,null,null,null,null,null,null,null,null,null,null,null,null,null,"Produktion und Fertigung"]
[null,null,null,null,null,null,null,null,null,null,null,null,null,null,null,null,null,null,null,null,"Produktmanagement"]
[null,null,null,null,null,null,null,null,null,null,null,null,null,null,null,null,null,null,null,null,"Projektmanagement"]
[null,null,null,null,null,null,null,null,null,null,null,null,null,null,null,null,null,null,null,null,"Prozessmanagement"]
[null,null,null,null,null,null,null,null,null,null,null,null,null,null,null,null,null,null,null,null,"Public Relation und Unternehmenskommunikation"]
[null,null,null,null,null,null,null,null,null,null,null,null,null,null,null,null,null,null,null,null,"Qualitätswesen"]
[null,null,null,null,null,null,null,null,null,null,null,null,null,null,null,null,null,null,null,null,"Rechnungswesen"]
[null,null,null,null,null,null,null,null,null,null,null,null,null,null,null,null,null,null,null,null,"Redaktion"]
[null,null,null,null,null,null,null,null,null,null,null,null,null,null,null,null,null,null,null,null,"Risikomanagement"]
[null,null,null,null,null,null,null,null,null,null,null,null,null,null,null,null,null,null,null,null,"Softwareentwicklung"]
[null,null,null,null,null,null,null,null,null,null,null,null,null,null,null,null,null,null,null,null,"Strategieentwicklung"]
[null,null,null,null,null,null,null,null,null,null,null,null,null,null,null,null,null,null,null,null,"Strategisches Produktmanagement"]
[null,null,null,null,null,null,null,null,null,null,null,null,null,null,null,null,null,null,null,null,"Unternehmenskommunikation und Public Relation"]
[null,null,null,null,null,null,null,null,null,null,null,null,null,null,null,null,null,null,null,null,"Vertrieb-Außendienst"]
[null,null,null,null,null,null,null,null,null,null,null,null,null,null,null,null,null,null,null,null,"Vertrieb-Innendienst"]
[null,null,null,null,null,null,null,null,null,null,null,null,null,null,null,null,null,null,null,null,"Vertriebssteuerung"]
[null,null,null,null,null,null,null,null,null,null,null,null,null,null,null,null,null,null,null,"Trainee_Filialleiter/_Verkaufsleiter","Vertrieb-Außendienst"]
[null,null,null,null,null,null,null,null,null,null,null,null,null,null,null,null,null,null,null,"Vertriebler","Vertrieb-Außendienst"]
[null,null,null,null,null,null,null,null,null,null,null,null,null,null,null,null,null,null,null,null,"Key Account Management"]
[null,null,null,null,null,null,null,null,null,null,null,null,null,null,null,null,null,null,null,null,"Account Management"]
[null,null,null,null,null,null,null,null,null,null,null,null,null,null,null,null,null,null,null,"Wirtschaftsprüfungsassistent/_Steuerassistent","Wirtschafts- und Steuerprüfung"]
[null,null,null,null,null,null,null,null,null,null,null,null,null,null,null,null,null,null,null,null,"Steuer- und Wirtschaftsprüfung"]
[null,null,null,null,null,null,null,null,null,null,null,null,null,null,null,null,null,null,null,"Wissenschaftlicher_Mitarbeiter","Forschung und Entwicklung"]
[null,null,null,null,null,null,null,null,null,null,null,null,null,null,null,null,null,null,null,null,"Marktforschung"]

{"sheet":"Qualifikation","index":5,"n_rows":55,"n_cols":15,"rows_kept":55,"cut":false,"hidden":false,"merged":[[34,3,34,6],[36,3,36,6],[34,9,34,12],[36,9,36,12],[11,3,11,6],[13,3,13,6],[15,3,15,6],[1,2,1,12],[6,1,6,2],[9,9,9,12],[11,9,11,12],[13,9,13,12],[15,9,15,12],[9,3,9,6],[19,1,19,2],[21,14,27,14],[23,3,23,6],[21,9,21,12],[23,9,23,12],[25,3,25,6],[27,3,27,6],[25,9,25,12],[27,9,27,12],[21,3,21,6]]}
[]
[null,null,{"$f":"IF(OR(Wunschunternehmen!D34=\"\",Wunschunternehmen!D34=\" - Bitte auswählen -\",Wunschunternehmen!D36=\"\",Wunschunternehmen!D36=\" - Bitte auswählen -\",Wunschunternehmen!D38=\"\",Wunschunternehmen!D38=\" - Bitte auswählen -\",Wunschunternehmen!D40=\"\",Wunschunternehmen!D40=\" - Bitte auswählen -\",Wunschunternehmen!D42=\"\",Wunschunternehmen!D42=\" - Bitte auswählen -\"),HYPERLINK(\"#Wunschunternehmen!D34\",\"ACHTUNG! Keine Analyse möglich!\"&CHAR(10)&\"Auf der vorherigen Seite müssen alle mit * gekennzeichneten Felder ausgefüllt werden. Bitte überprüfen Sie Ihre Angaben hierzu.\"),\"\")","v":"ACHTUNG! Keine Analyse möglich!\nAuf der vorherigen Seite müssen alle mit * gekennzeichneten Felder ausgefüllt werden. Bitte überprüfen Sie Ihre Angaben hierzu."}]
[]
[]
[]
[]
[null,"Zusatzqualifikationen i"]
[null,"(wie z. B. MBA, LL.M. etc.)",null,"Erste Zusatzqualifikation",null,null,null,null,null,"Zweite Zusatzqualifikation",null,null,null,null,{"$f":"IF(ISERROR(FIND(\"MBA\",D10)),\"\",\"MBA\")","v":""}]
[null,null,null,null,null,null,null,null,null,null,null,null,null,null,{"$f":"IF(ISERROR(FIND(\"MBA\",J10)),\"\",\"MBA\")","v":""}]
[null,null,"Bezeichnung",null,null,null,null,null,null,null,null,null,null,{"$f":"IF(OR(D10<>\"\",J10<>\"\"),\"befüllt\",\"\")","v":""},{"$f":"IF(AND(O8=\"\",O9=\"\"),\"\",\"MBA\")","v":""}]
[]
[null,null,"Hochschulname/Institutsname"]
[]
[null,null,"Dauer (in Monaten)"]
[]
[null,null,"Land"," - Bitte auswählen -",null,null,null,null,null," - Bitte auswählen -"]
[]
[]
[]
[null,"Sprachkenntnissei",null,"Sprache",null,null,null,null,null,"Kenntnisse"]
[]
[null,null,"1. Sprache"," - Bitte auswählen -",null,null,null,null,null," - Bitte auswählen -",null,null,null,null,{"$f":"IF(OR(J22=\"Verhandlungssicher\",J24=\"Verhandlungssicher\",J26=\"Verhandlungssicher\",J28=\"Verhandlungssicher\"),\"Verhandlungssicher: Damit ist das höchste Niveau der mündlichen und schriftlichen Beherrschung einer Fremdsprache gemeint. Wir werden in Ihrer Gehaltsanalyse auf Sprachkenntnisse eingehen. Daher sollte Ihre Einschätzung so objektiv wie möglich sein.\",IF(OR(J22=\"Muttersprache\",J24=\"Muttersprache\",J26=\"Muttersprache\",J28=\"Muttersprache\"),\"Bitte Ihre Muttersprache(n) nicht noch einmal als verhandlungssicher, fließend in Wort und Schrift usw. angeben. \",\"\"))","v":""}]
[]
[null,null,"2. Sprache"," - Bitte auswählen -",null,null,null,null,null," - Bitte auswählen -"]
[]
[null,null,"3. Sprache"," - Bitte auswählen -",null,null,null,null,null," - Bitte auswählen -"]
[]
[null,null,"4. Sprache"," - Bitte auswählen -",null,null,null,null,null," - Bitte auswählen -"]
[]
[]
[]
[null,"Berufsausbildung/ Lehre"]
[null,"(z. B. Bankkauffrau/-mann etc.)",null,"Erste Ausbildung",null,null,null,null,null,"Zweite Ausbildung"]
[]
[null,null,"Bezeichnung i"]
[]
[null,null,"Dauer (in Jahren)"]
[]
[]
[]
[]
[null,"Ihre bisherigen Praktika"]
[null,"(keine Aushilfstätigkeiten etc.)",null,"1. Praktikum",null,null,"2. Praktikum",null,null,"3. Praktikum",null,null,"4. Praktikum"]
[]
[null,null,"Arbeitgeber i",null,null,null,null,null,null,null,null,null,null,null,{"$f":"IF(D53=\"\",\"\",IF(D45=\"\",\"\",IF(ISERROR(FIND(\"Diplomand\",D45)),IF(ISERROR(FIND(\"Werkstudent\",D45)),\"\",\"Werkstudent\"),\"Diplomand\")))","v":""}]
[]
[null,null,"Einsatzort"," - Bitte auswählen -",null,null," - Bitte auswählen -",null,null," - Bitte auswählen -",null,null," - Bitte auswählen -",null,{"$f":"IF(G53=\"\",\"\",IF(G45=\"\",\"\",IF(ISERROR(FIND(\"Diplomand\",G45)),IF(ISERROR(FIND(\"Werkstudent\",G45)),\"\",\"Werkstudent\"),\"Diplomand\")))","v":""}]
[]
[null,null,"Branche"," - Bitte auswählen -",null,null," - Bitte auswählen -",null,null," - Bitte auswählen -",null,null," - Bitte auswählen -",null,{"$f":"IF(J53=\"\",\"\",IF(J45=\"\",\"\",IF(ISERROR(FIND(\"Diplomand\",J45)),IF(ISERROR(FIND(\"Werkstudent\",J45)),\"\",\"Werkstudent\"),\"Diplomand\")))","v":""}]
[]
[null,null,"Dauer (in Monaten)",null,null,null,null,null,null,null,null,null,null,null,{"$f":"IF(M53=\"\",\"\",IF(M45=\"\",\"\",IF(ISERROR(FIND(\"Diplomand\",M45)),IF(ISERROR(FIND(\"Werkstudent\",M45)),\"\",\"Werkstudent\"),\"Diplomand\")))","v":""}]
[]
[null,null,"Gehalt (pro Monat)"]
[]
[null,null,"Praktikumsbeginn (Jahr) i"]

{"sheet":"Ende","index":6,"n_rows":14,"n_cols":2,"rows_kept":14,"cut":false,"hidden":false,"merged":[[13,1,13,12]]}
[]
[]
[]
[]
[]
[]
[]
[]
[]
[]
[]
[null,"Vielen Dank für Ihr Interesse!"]
[]
[null,{"$f":"IF(AND(Wunschunternehmen!D3=\"\",Qualifikation!C2=\"\"),\"Sie können den Fragebogen jetzt abspeichern.\",IF(AND(Wunschunternehmen!D3<>\"\",Qualifikation!C2<>\"\"),\"Die Hochschulart, der Fachbereich und der Abschluss müssen unbedingt angegeben werden. Bitte wählen Sie Ihre Angaben hierzu im ersten Blatt vollständig aus.\"&CHAR(10)&\"Bei den Angaben zu Ihren Wunschunternehmen müssen alle mit * gekennzeichneten Felder ausgefüllt werden. Bitte wählen Sie Ihre Angaben hierzu im zweiten Blatt vollständig aus.\",IF(Wunschunternehmen!D3<>\"\",\"Die Hochschulart, der Fachbereich und der Abschluss müssen unbedingt angegeben werden. Bitte wählen Sie Ihre Angaben hierzu im ersten Blatt vollständig aus.\",IF(Qualifikation!C2<>\"\",\"Bei den Angaben zu Ihren Wunschunternehmen müssen alle mit * gekennzeichneten Felder ausgefüllt werden. Bitte wählen Sie Ihre Angaben hierzu im zweiten Blatt vollständig aus.\",))))","v":"Die Hochschulart, der Fachbereich und der Abschluss müssen unbedingt angegeben werden. Bitte wählen Sie Ihre Angaben hierzu im ersten Blatt vollständig aus.\nBei den Angaben zu Ihren Wunschunternehmen müssen alle mit * gekennzeichneten Felder ausgefüllt werden. Bitte wählen Sie Ihre Angaben hierzu im zweiten Blatt vollständig aus."}]

{"sheet":"Extrablatt","index":7,"n_rows":247,"n_cols":211,"rows_kept":247,"cut":false,"hidden":false,"merged":[]}
["Attribut GDB","Attribut FB","Bogendaten","Rückmeldung","Analyse/Word-Vorlage","Gehaltsdatenbank",null,"Legende"]
["xx","xx","xx","xx","xx","xx",null,"Leere Zelle"]
[null,"Anrede",null,null,{"$f":"IF(AND(OR(C12=0,C12=\"\",C12=\" - Bitte auswählen -\"),C4<>\"\",C5<>\"\"),C4&\" \"&C5,IF(OR(AND(C4=\"\",C5=\"\"),AND(C4<>\"\",C5=\"\"),AND(C12=\" - Bitte auswählen -\"),AND(C12=0)),\"\",IF(AND(C4=\"\",C5<>\"\",C12=\"weiblich\"),\"Frau \" &C5,IF(AND(C4=\"\",C5<>\"\",C12=\"männlich\"),\"Herr \" &C5,IF(AND(C12=\"weiblich\",C4<>\"\",C5<>\"\"),\"Frau \"&C4&\" \"&C5,IF(C12=\"männlich\",\"Herr \"&C4&\" \"&C5))))))","v":""},null,null,"Formel"]
[null,"Vorname",{"$f":"IF('Ausbildung '!E4=0,\"\",PROPER('Ausbildung '!E4))","v":""},null,{"$f":"IF(OR(C12=0,C12=\" - Bitte auswählen -\"),\"Sehr geehrter Kunde/Interessent,\",IF(AND(C5=\"\"),\"Sehr geehrter Kunde/Interessent,\",IF(C12=\"weiblich\",\"Sehr geehrte Frau \"&C5&\",\",IF(C12=\"männlich\",\"Sehr geehrter Herr \"&C5&\",\"))))","v":"Sehr geehrter Kunde/Interessent,"},null,null,"Pflichtfelder (händ. Analyse)"]
[null,"Nachname",{"$f":"IF('Ausbildung '!E6=0,\"\",PROPER('Ausbildung '!E6))","v":""},null,null,null,null,"Defaultwerte"]
[null,"PLZ, Wohnort",{"$f":"'Ausbildung '!I6","v":0},null,null,null,null,"Konstanten"]
[null,"Straße, Hausnummer",{"$f":"'Ausbildung '!I4","v":0}]
[null,"E-Mail",{"$f":"'Ausbildung '!I10","v":0}]
[null,"Tel",{"$f":"'Ausbildung '!I8","v":0}]
["BPISALARYID",null,null,null,null,null,null,"JETZT"]
["QUESTIONNAIREID",null,null,null,null,null,null,{"$f":"NOW()","v":"2020-02-07T21:24:48.240"}]
["SEX","Geschlecht (männlich/weiblich)",{"$f":"'Ausbildung '!E8","v":" - Bitte auswählen -"},{"$f":"IF(OR(C12=\" - Bitte auswählen -\",C12=0),\"\",C12)","v":""},{"$f":"IF(OR(C12=\" - Bitte auswählen -\",C12=0),\"\",C12)","v":""},{"$f":"IF(OR(C12=\"männlich\",C12=\" - Bitte auswählen -\",C12=0),\"m\",\"w\")","v":"m"},null,{"$f":"TEXT(NOW(),\"TTMMJJJJ hhmmss\")","v":"07022020 212448"}]
["AGE","Alter",{"$f":"IF(C14=\"\",\"\",TEXT(TODAY()-C14,\"jj\")*1)","v":""},{"$f":"C13","v":""},{"$f":"C13","v":""}]
["BIRTHDATE","Geburtsdatum",{"$f":"IF('Ausbildung '!E10=\"\",\"\",'Ausbildung '!E10)","v":""},null,null,{"$f":"C14","v":""},null,"HEUTE"]
["CAREERPHASE",null,null,null,null,{"$f":"IF(C32>TODAY(),1,2)","v":1},null,{"$f":"TODAY()","v":"2020-02-07"}]
["CUSTGROUP","MLP-Kunde (Ja/Nein)",{"$f":"'Ausbildung '!E13","v":" - Bitte auswählen -"},null,null,{"$f":"IF(C16=\"Ja\",1,2)","v":2},null,{"$f":"TEXT(TODAY(),\"TTMMJJJJ\")","v":"07022020"}]
["JOBSTARTER",null,null,null,null,"ja"]
["ENTERDATE",null,null,null,null,{"$f":"TODAY()","v":"2020-02-07"}]
["SOURCE",null,null,null,null,30]
["DOUBLEDEGREE","Doppelstudium (Ja/Nein)",{"$f":"IF('Ausbildung '!E36=\"\",\"Nein\",'Ausbildung '!E36)","v":"Nein"},{"$f":"C20","v":"Nein"},{"$f":"C20","v":"Nein"},{"$f":"LOWER(C20)","v":"nein"}]
["INSTITUTETYPE","Hochschulart",{"$f":"'Ausbildung '!E22","v":" - Bitte auswählen -"},{"$f":"IF(OR(C21=\" - Bitte auswählen -\",C21=0),\"\",C21)","v":""},{"$f":"IF(OR(C21=\" - Bitte auswählen -\",C21=0),\"\",C21)","v":""},{"$f":"IF(C21=0,\"0\",VLOOKUP(C21,Aufschlüsselung!O2:P14,2,FALSE))","v":0}]
["INSTITUTE","Hochschulname",{"$f":"IF('Ausbildung '!E26=0,\"\",'Ausbildung '!E26)","v":""},{"$f":"C22","v":""},{"$f":"C22","v":""},{"$f":"C22","v":""}]
["EDUCITY","Hochschulort",{"$f":"IF('Ausbildung '!E24=0,\"\",'Ausbildung '!E24)","v":""},null,null,{"$f":"IF(ISERROR(VLOOKUP(C23,#REF!,2,FALSE)),C23,VLOOKUP(C23,#REF!,2,FALSE))","v":""}]
["STUDYCOURSE","Studiengang",{"$f":"'Ausbildung '!E30","v":" - Bitte auswählen -"},{"$f":"IF(OR(C24=0,C24=\" - Bitte auswählen -\",C24=\" - Bitte zuerst Fachbereich auswählen -\"),\"\",C24)","v":""},{"$f":"IF(OR(C24=0,C24=\" - Bitte auswählen -\",C24=\" - Bitte zuerst Fachbereich auswählen -\"),\"keine Angabe\",C24)","v":"keine Angabe"},{"$f":"IF(OR(C24=0,C24=\" - Bitte auswählen -\",C24=\" - Bitte zuerst Fachbereich auswählen -\"),\"\",VLOOKUP(C24,Aufschlüsselung!U:V,2,FALSE))","v":""}]
["FACULTY","Fachbereich",{"$f":"'Ausbildung '!E28","v":" - Bitte auswählen -"},{"$f":"IF(OR(C25=0,C25=\" - Bitte auswählen -\"),\"\",C25)","v":""},{"$f":"IF(OR(C25=0,C25=\" - Bitte auswählen -\"),\"keine_Angabe\",C25)","v":"keine_Angabe"},{"$f":"IF(OR(C25=0,C25=\" - Bitte auswählen -\"),\"0\",VLOOKUP(C25,Aufschlüsselung!S2:T10,2,FALSE))","v":"0"}]
["FIRSTMAJORFIELD"]
["FIRSTDURATION","(Voraussichtliche) Studiendauer",{"$f":"'Ausbildung '!I22","v":0},null,null,{"$f":"IF(C27=0,\"\",C27)","v":""}]
["FIRSTDEGREE","(Bevorstehender) höchster akademischer Abschluss",{"$f":"'Ausbildung '!E32","v":" - Bitte auswählen -"},{"$f":"IF(OR(C28=0,C28=\" - Bitte auswählen -\"),\"\",C28)","v":""},{"$f":"IF(OR(C28=0,C28=\" - Bitte auswählen -\"),\"keine Angabe\",C28)","v":"keine Angabe"},{"$f":"IF(OR(C28=0,C28=\" - Bitte auswählen -\"),\"10\",VLOOKUP(C28,Aufschlüsselung!Q2:R13,2,FALSE))","v":"10"}]
["INTEREXAMGRADE1"]
["EXAMGRADE1","Abschluss-/Examensnote",{"$f":"'Ausbildung '!I30","v":0},null,null,{"$f":"IF(C30=0,\"\",C30)","v":""}]
["FIRSTPHDGRADE","Promotionsbewertung",{"$f":"'Ausbildung '!I32","v":"keine"},null,null,{"$f":"IF(OR(C31=0,C31=\" - Bitte auswählen -\"),\"0\",VLOOKUP(C31,Aufschlüsselung!D45:E50,2,FALSE))","v":0}]
[null,"(Voraussichtliches) Studienende",{"$f":"IF('Ausbildung '!I26=0,\"\",'Ausbildung '!I26)","v":""}]
["INSTITUTETYPE2","Hochschulart Doppel- bzw. Zweitstudium"]
["INSTITUTE2","Hochschulname Doppel- bzw. Zweitstudium"]
["EDUCITY2","Hochschulort Doppel- bzw. Zweitstudium"]
["STUDYCOURSE2","Studiengang Doppel- bzw. Zweitstudium"]
["FACULTY2","Fachbereich Doppel- bzw. Zweitstudium"]
["SECONDMAJORFIELD"]
["SECONDDURATION","(Voraussichtliche) Studiendauer Doppel- bzw. Zweitstudium"]
["SECONDDEGREE","(Voraussichtlicher) akademischer Abschluss Doppel- bzw. Zweitstudium"]
["INTEREXAMGRADE2"]
["EXAMGRADE2","Abschluss-/Examensnote Doppel- bzw. Zweitstudium"]
["SECONDPHDGRADE","Promotionsbewertung Doppel- bzw. Zweitstudium"]
[null,"(Voraussichtliches) Studienende"]
["ADDSKILLINSTITUTE","Hochschulname/Institutsname Erste Zusatzqualifikation",{"$f":"Qualifikation!D12","v":0},null,null,{"$f":"IF(C45=0,\"\",C45)","v":""}]
["ADDITONALSKILL","Bezeichnung Erste Zusatzqualifikation",{"$f":"Qualifikation!D10","v":0},"enthält \"MBA\" =>",{"$f":"Qualifikation!O10","v":""},{"$f":"IF(C46=0,\"\",C46)","v":""}]
["ADDSKILLSPECIAL"]
["ADDITONALSKILLDURATION","Dauer (in Monaten) Erste Zusatzqualifikation",{"$f":"Qualifikation!D14","v":0},null,null,{"$f":"IF(C48=0,\"\",C48)","v":""}]
["ADDSKILLCITY"]
["ADDSKILLCOUNTRY","Land Erste Zusatzqualifikation",{"$f":"Qualifikation!D16","v":" - Bitte auswählen -"},null,null,{"$f":"VLOOKUP(C50,Aufschlüsselung!G:H,2,FALSE)","v":""}]
["ADDSKILLINSTITUTE2","Hochschulname/Institutsname Zweite Zusatzqualifikation",{"$f":"Qualifikation!J12","v":0},null,null,{"$f":"IF(C51=0,\"\",C51)","v":""}]
["ADDITIONALSKILL2","Bezeichnung Zweite Zusatzqualifikation",{"$f":"Qualifikation!J10","v":0},null,null,{"$f":"IF(C52=0,\"\",C52)","v":""}]
["ADDSKILLSPECIAL2"]
["ADDSKILLDURATION2","Dauer (in Monaten) Zweite Zusatzqualifikation",{"$f":"Qualifikation!J14","v":0},null,null,{"$f":"IF(C54=0,\"\",C54)","v":""}]
["ADDSKILLCITY2"]
["ADDSKILLCOUNTRY2","Land Zweite Zusatzqualifikation",{"$f":"Qualifikation!J16","v":" - Bitte auswählen -"},null,null,{"$f":"VLOOKUP(C56,Aufschlüsselung!G:H,2,FALSE)","v":""}]
["LANGUAGE1","1. Sprache",{"$f":"Qualifikation!D22","v":" - Bitte auswählen -"},null,null,{"$f":"VLOOKUP(C57,Aufschlüsselung!I:J,2,FALSE)","v":""}]
["LANGSKILL1","1. Sprache Kenntnisse",{"$f":"Qualifikation!J22","v":" - Bitte auswählen -"},null,null,{"$f":"VLOOKUP(C58,Aufschlüsselung!K2:L8,2,FALSE)","v":6}]
["LANGUAGE2","2. Sprache",{"$f":"Qualifikation!D24","v":" - Bitte auswählen -"},null,null,{"$f":"VLOOKUP(C59,Aufschlüsselung!I:J,2,FALSE)","v":""}]
["LANGSKILL2","2. Sprache Kenntnisse",{"$f":"Qualifikation!J24","v":" - Bitte auswählen -"},null,null,{"$f":"VLOOKUP(C60,Aufschlüsselung!K2:L8,2,FALSE)","v":6}]
["LANGUAGE3","3. Sprache",{"$f":"Qualifikation!D26","v":" - Bitte auswählen -"},null,null,{"$f":"VLOOKUP(C61,Aufschlüsselung!I:J,2,FALSE)","v":""}]
["LANGSKILL3","3. Sprache Kenntnisse",{"$f":"Qualifikation!J26","v":" - Bitte auswählen -"},null,null,{"$f":"VLOOKUP(C62,Aufschlüsselung!K2:L8,2,FALSE)","v":6}]
["LANGUAGE4","4. Sprache",{"$f":"Qualifikation!D28","v":" - Bitte auswählen -"},null,null,{"$f":"VLOOKUP(C63,Aufschlüsselung!I:J,2,FALSE)","v":""}]
["LANGSKILL4","4. Sprache Kenntnisse",{"$f":"Qualifikation!J28","v":" - Bitte auswählen -"},null,null,{"$f":"VLOOKUP(C64,Aufschlüsselung!K2:L8,2,FALSE)","v":6}]
["LANGUAGE5"]
["LANGSKILL5",null,null,null,null,6]
["SEMABROADINSTITUTE1"]
["SEMABROADDURATION1","Semesteranzahl Erster Auslandsaufenthalt",{"$f":"'Ausbildung '!E43","v":0},null,null,{"$f":"IF(C68=0,\"\",C68)","v":""}]
["SEMABROADCITY1"]
["SEMABROADCOUNTRY1","Land Erster Auslandsaufenthalt",{"$f":"'Ausbildung '!E45","v":" - Bitte auswählen -"},null,null,{"$f":"IF(C70=0,\"\",VLOOKUP(C70,Aufschlüsselung!G2:H195,2,FALSE))","v":""}]
["SEMABROADINSTITUTE2"]
["SEMABROADDURATION2","Semesteranzahl Zweiter Auslandsaufenthalt",{"$f":"'Ausbildung '!G43","v":0},null,null,{"$f":"IF(C72=0,\"\",C72)","v":""}]
["SEMABROADCITY2"]
["SEMABROADCOUNTRY2","Land Zweiter Auslandsaufenthalt",{"$f":"'Ausbildung '!G45","v":" - Bitte auswählen -"},null,null,{"$f":"IF(C74=0,\"\",VLOOKUP(C74,Aufschlüsselung!G2:H195,2,FALSE))","v":""}]
["SEMABROADINSTITUTE3"]
["SEMABROADDURATION3","Semesteranzahl Dritter Auslandsaufenthalt",{"$f":"'Ausbildung '!I43","v":0},null,null,{"$f":"IF(C76=0,\"\",C76)","v":""}]
["SEMABROADCITY3"]
["SEMABROADCOUNTRY3","Land Dritter Auslandsaufenthalt",{"$f":"'Ausbildung '!I45","v":" - Bitte auswählen -"},null,null,{"$f":"IF(C78=0,\"\",VLOOKUP(C78,Aufschlüsselung!G2:H195,2,FALSE))","v":""}]
["EDUDESCRIPTION1","Erste Ausbildung Bezeichnung",{"$f":"Qualifikation!D35","v":0},null,null,{"$f":"IF(C79=0,\"\",C79)","v":""},null,null,null," "]
["EDUDESCRIPTION2","Zweite Ausbildung Bezeichnung",{"$f":"Qualifikation!J35","v":0},null,null,{"$f":"IF(C80=0,\"\",C80)","v":""}]
[null,"Erste Ausbildung Dauer",{"$f":"Qualifikation!D37","v":0}]
[null,"Zweite Ausbildung Dauer",{"$f":"Qualifikation!J37","v":0},null,null,null,null,null,null," "]
["COMPANYNAME1","1. Praktikum Arbeitgeber",{"$f":"Qualifikation!D45","v":0},null,null,{"$f":"IF(C83=0,\"\",C83)","v":""}]
["CITY1","1. Praktikum Einsatzort (Bundesland/Ausland)",{"$f":"Qualifikation!D47","v":" - Bitte auswählen -"},null,null,{"$f":"IF(OR(C84=0,C84=\" - Bitte auswählen -\"),\"\",C84)","v":""}]
[null,"1. Praktikum Branche",{"$f":"IF(Qualifikation!D49=\"Gen- und Biotechnologie\",\"Bio- und Gentechnologie\",IF(Qualifikation!D49=\"Event- und Kulturmanagement\",\"Kultur- und Eventmanagement\",IF(Qualifikation!D49=\"Wirtschaftsprüfung und Steuerberatung\",\"Steuerberatung und Wirtschaftsprüfung\",IF(OR(Qualifikation!D49=\"Public Relation, Werbung und Marketing\",Qualifikation!D49=\"Marketing, Werbung und Public Relation\"),\"Werbung, Public Relation und Marketing\",Qualifikation!D49))))","v":" - Bitte auswählen -"}]
["FOACTION1"]
["INTERNSHIPDURATION1","1. Praktikum Dauer (in Monaten)",{"$f":"Qualifikation!D51","v":0},null,null,{"$f":"IF(C87=0,\"\",C87)","v":""}]
["INTERNSHIPSALARY1","1. Praktikum Gehalt (pro Monat)",{"$f":"IF(Qualifikation!D53=\"\",\"\",Qualifikation!D53)","v":""},null,null,{"$f":"IF(C88=\"\",\"\",C88)","v":""}]
["INTERNSHIPSTARTDATE1","1. Praktikum Datum (Jahr)",{"$f":"Qualifikation!D55","v":0},null,null,{"$f":"IF(C89=0,\"\",IF(LEN(C89)=4,DATE(C89,1,1),C89))","v":""}]
["COMPANYNAME2","2. Praktikum Arbeitgeber",{"$f":"Qualifikation!G45","v":0},null,null,{"$f":"IF(C90=0,\"\",C90)","v":""}]
["CITY2","2. Praktikum Einsatzort (Bundesland/Ausland)",{"$f":"Qualifikation!G47","v":" - Bitte auswählen -"},null,null,{"$f":"IF(OR(C91=0,C91=\" - Bitte auswählen -\"),\"\",C91)","v":""}]
[null,"2. Praktikum Branche",{"$f":"IF(Qualifikation!G49=\"Gen- und Biotechnologie\",\"Bio- und Gentechnologie\",IF(Qualifikation!G49=\"Event- und Kulturmanagement\",\"Kultur- und Eventmanagement\",IF(Qualifikation!G49=\"Wirtschaftsprüfung und Steuerberatung\",\"Steuerberatung und Wirtschaftsprüfung\",IF(OR(Qualifikation!G49=\"Public Relation, Werbung und Marketing\",Qualifikation!G49=\"Marketing, Werbung und Public Relation\"),\"Werbung, Public Relation und Marketing\",Qualifikation!G49))))","v":" - Bitte auswählen -"}]
["FOACTION2"]
["INTERNSHIPDURATION2","2. Praktikum Dauer (in Monaten)",{"$f":"Qualifikation!G51","v":0},null,null,{"$f":"IF(C94=0,\"\",C94)","v":""}]
["INTERNSHIPSALARY2","2. Praktikum Gehalt (pro Monat)",{"$f":"IF(Qualifikation!G53=\"\",\"\",Qualifikation!G53)","v":""},null,null,{"$f":"IF(C95=\"\",\"\",C95)","v":""}]
["INTERNSHIPSTARTDATE2","2. Praktikum Datum (Jahr)",{"$f":"Qualifikation!G55","v":0},null,null,{"$f":"IF(C96=0,\"\",IF(LEN(C96)=4,DATE(C96,1,1),C96))","v":""}]
["COMPANYNAME3","3. Praktikum Arbeitgeber",{"$f":"Qualifikation!J45","v":0},null,null,{"$f":"IF(C97=0,\"\",C97)","v":""}]
["CITY3","3. Praktikum Einsatzort (Bundesland/Ausland)",{"$f":"IF(Qualifikation!J47=\"\",\"\",Qualifikation!J47)","v":" - Bitte auswählen -"},null,null,{"$f":"IF(OR(C98=0,C98=\" - Bitte auswählen -\"),\"\",C98)","v":""}]
[null,"3. Praktikum Branche",{"$f":"IF(Qualifikation!J49=\"Gen- und Biotechnologie\",\"Bio- und Gentechnologie\",IF(Qualifikation!J49=\"Event- und Kulturmanagement\",\"Kultur- und Eventmanagement\",IF(Qualifikation!J49=\"Wirtschaftsprüfung und Steuerberatung\",\"Steuerberatung und Wirtschaftsprüfung\",IF(OR(Qualifikation!J49=\"Public Relation, Werbung und Marketing\",Qualifikation!J49=\"Marketing, Werbung und Public Relation\"),\"Werbung, Public Relation und Marketing\",Qualifikation!J49))))","v":" - Bitte auswählen -"}]
["FOACTION3"]
["INTERNSHIPDURATION3","3. Praktikum Dauer (in Monaten)",{"$f":"Qualifikation!J51","v":0},null,null,{"$f":"IF(C101=0,\"\",C101)","v":""}]
["INTERNSHIPSALARY3","3. Praktikum Gehalt (pro Monat)",{"$f":"IF(Qualifikation!J53=\"\",\"\",Qualifikation!J53)","v":""},null,null,{"$f":"IF(C102=\"\",\"\",C102)","v":""}]
["INTERNSHIPSTARTDATE3","3. Praktikum Datum (Jahr)",{"$f":"Qualifikation!J55","v":0},null,null,{"$f":"IF(C103=0,\"\",IF(LEN(C103)=4,DATE(C103,1,1),C103))","v":""}]
["COMPANYNAME4","4. Praktikum Arbeitgeber",{"$f":"Qualifikation!M45","v":0},null,null,{"$f":"IF(C104=0,\"\",C104)","v":""}]
["CITY4","4. Praktikum Einsatzort (Bundesland/Ausland)",{"$f":"IF(Qualifikation!M47=\"\",\"\",Qualifikation!M47)","v":" - Bitte auswählen -"},null,null,{"$f":"IF(OR(C105=0,C105=\" - Bitte auswählen -\"),\"\",C105)","v":""}]
[null,"4. Praktikum Branche",{"$f":"IF(Qualifikation!M49=\"Gen- und Biotechnologie\",\"Bio- und Gentechnologie\",IF(Qualifikation!M49=\"Event- und Kulturmanagement\",\"Kultur- und Eventmanagement\",IF(Qualifikation!M49=\"Wirtschaftsprüfung und Steuerberatung\",\"Steuerberatung und Wirtschaftsprüfung\",IF(OR(Qualifikation!M49=\"Public Relation, Werbung und Marketing\",Qualifikation!M49=\"Marketing, Werbung und Public Relation\"),\"Werbung, Public Relation und Marketing\",Qualifikation!M49))))","v":" - Bitte auswählen -"}]
["FOACTION4"]
["INTERNSHIPDURATION4","4. Praktikum Dauer (in Monaten)",{"$f":"Qualifikation!M51","v":0},null,null,{"$f":"IF(C108=0,\"\",C108)","v":""}]
["INTERNSHIPSALARY4","4. Praktikum Gehalt (pro Monat)",{"$f":"IF(Qualifikation!M53=\"\",\"\",Qualifikation!M53)","v":""},null,null,{"$f":"IF(C109=\"\",\"\",C109)","v":""}]
["INTERNSHIPSTARTDATE4","4. Praktikum Datum (Jahr)",{"$f":"Qualifikation!M55","v":0},null,null,{"$f":"IF(C110=0,\"\",IF(LEN(C110)=4,DATE(C110,1,1),C110))","v":""}]
["COMPANYNAME5"]
["CITY5"]
["FOACTION5"]
["INTERNSHIPDURATION5"]
["INTERNSHIPSALARY5"]
["INTERNSHIPSTARTDATE5"]
["COMPANYNAME6"]
["CITY6"]
["FOACTION6"]
["INTERNSHIPDURATION6"]
["INTERNSHIPSALARY6"]
["INTERNSHIPSTARTDATE6"]
["WORKEXPERIENCE",null,null,null,null,0]
["YEARSWEXPNATIONAL"]
["YEARSWEXPABROAD"]
["WORKEXPCOUNTRY1"]
["WORKEXPDURATION1"]
["WORKEXPCOUNTRY2"]
["WORKEXPDURATION2"]
["WORKEXPCOUNTRY3"]
["WORKEXPDURATION3"]
["EMPLOYERCHGCOUNT"]
["COMPANYNAME"]
["LEGALFORM",null,null,null,null,13]
["INDUSTRY"]
["STAFFSIZENATIONAL"]
["STAFFSIZEWORLD"]
["STAFFSIZELOCAL"]
["POSTCODE"]
["CITY"]
["FEDERALSTATE"]
["COUNTRY"]
["ENTRYDATE"]
["WORKHOURS"]
["REALWORKHOURSFROM"]
["REALWORKHOURSTO"]
["ENTRYPOSITION"]
["ENTRYFIELDOFACTION"]
["CURRENTPOSITION"]
["ENTRYDATECURRENTPOSITION"]
["FIELDOFACTION"]
["STAFFRESPONSIBILITY"]
["BASESALARY"]
["SALARYCOUNT"]
["VACATIONBONUS"]
["CHRISTMASBONUS"]
["SALARY"]
["BONUS"]
["BONUSUPTO"]
["BONUSGUARANTEED"]
["CMPNYPAYEDPENSION"]
["COMPANYCAR"]
["CCPRIVATUSE"]
["CCALLOWBUDGET"]
["CCBUDGETGROSS"]
["CAPITALFORMPAYMENT"]
["OTHERNCBDESC"]
["OTHERNCBAMOUNT"]
["EDUFINANCINGAMOUNT"]
["ADDCNTRBDESC"]
["ADDCNTRBAMOUNT"]
["VARSALARYEXWU"]
["VARIABLESALARYUPTO"]
["VARIABLESALARY"]
["VARIABLESALARYUPTO"]
["TOTALSALARY"]
["TOTALSALARYUPTO"]
["TOTALGURANTEEDSALARY"]
["SALARYTARIFF"]
["BUDGETRESPONSIBILITY"]
["ENTRYSALARY"]
["LASTSALARYINCDATE"]
["LASTSALARYINCREASEAMOUNT"]
["LASTSALARYINCPERCENT"]
["LASTSALARYINCTOTAL"]
["SECONDSALARYINCDATE"]
["SECONDSALARYINCREASEAMOUNT"]
["SECONDSALARYINCPERCENT"]
["SECONDSALARYINCTOTAL"]
["THIRDSALARYINCDATE"]
["THIRDSALARYINCREASEAMOUNT"]
["THIRDSALARYINCPERCENT"]
["THIRDSALARYINCTOTAL"]
["DESIREDCOMPANY1","WUN1 Name",{"$f":"Wunschunternehmen!D32","v":" - Optional -"},null,{"$f":"IF(OR(C194=\" - Optional -\",C194=0),\"keine Angabe\",C194)","v":"keine Angabe"},{"$f":"IF(OR(C194=\" - Optional -\",C194=0),\"\",C194)","v":""}]
["DESIREDINDUSTRY1","WUN1 Branche",{"$f":"Wunschunternehmen!D34","v":" - Bitte auswählen -"},null,{"$f":"IF(OR(C195=\" - Bitte auswählen -\",C195=0),\"keine Angabe\",IF(C195=\"Gen- und Biotechnologie\",\"Bio- und Gentechnologie\",IF(C195=\"Event- und Kulturmanagement\",\"Kultur- und Eventmanagement\",IF(C195=\"Wirtschaftsprüfung und Steuerberatung\",\"Steuerberatung und Wirtschaftsprüfung\",IF(OR(C195=\"Public Relation, Werbung und Marketing\",C195=\"Marketing, Werbung und Public Relation\"),\"Werbung, Public Relation und Marketing\",C195)))))","v":"keine Angabe"},{"$f":"IF(OR(C195=0,C195=\" - Bitte auswählen -\"),\"\",VLOOKUP(C195,Aufschlüsselung!$X$2:$Y$76,2,FALSE))","v":""},null,"Branche Doppelte Werte!"]
["DESIREDCITY1","WUN1 Standort",{"$f":"Wunschunternehmen!D42","v":" - Bitte auswählen -"},null,{"$f":"IF(OR(C196=\" - Bitte auswählen -\",C196=0),\"keine Angabe\",C196)","v":"keine Angabe"},{"$f":"IF(OR(C196=\" - Bitte auswählen -\",C196=0),\"\",C196)","v":""},null,"Bio- und Gentechnologie","Gen- und Biotechnologie"]
["DESIREDPOSITION1","WUN1 Position",{"$f":"Wunschunternehmen!D36","v":" - Bitte auswählen -"},null,{"$f":"IF(OR(C197=\" - Bitte auswählen -\",C197=\" - Bitte zuerst Fachbereich auswählen -\",C197=0),\"keine Angabe\",IF(C197=\"Syndikus/_Justiziar\",\"Justiziar/_Syndikus\",IF(C197=\"Wirtschaftsprüfungsassistent/_Steuerassistent\",\"Steuerassistent/_Wirtschaftsprüfungsassistent\",C197)))","v":"keine Angabe"},{"$f":"VLOOKUP(C197,Aufschlüsselung!AC2:AD50,2,FALSE)","v":""},null,"Kultur- und Eventmanagement","Event- und Kulturmanagement"]
["DESIREDFOACTION1","WUN1 Tätigkeitsbereich",{"$f":"Wunschunternehmen!D38","v":" - Bitte auswählen -"},null,{"$f":"IF(OR(C198=\" - Bitte auswählen -\",C198=\" - Bitte zuerst Position auswählen -\",C198=0),\"keine Angabe\",IF(C198=\"Public Relation und Unternehmenskommunikation\",\"Unternehmenskommunikation und Public Relation\",IF(C198=\"Steuer- und Wirtschaftsprüfung\",\"Wirtschafts- und Steuerprüfung\",C198)))","v":"keine Angabe"},{"$f":"VLOOKUP(C198,Aufschlüsselung!BE2:BF76,2,FALSE)","v":""},null,"Steuerberatung und Wirtschaftsprüfung","Wirtschaftsprüfung und Steuerberatung"]
[null,"WUN1 Unternehmensgröße",{"$f":"Wunschunternehmen!D40","v":" - Bitte auswählen -"},null,{"$f":"IF(OR(C199=\" - Bitte auswählen -\",C199=0),\"keine Angabe\",C199)","v":"keine Angabe"},null,null,"Werbung, Public Relation und Marketing","Public Relation, Werbung und Marketing"]
["DESIREDCOMPANY2","WUN2 Name",{"$f":"Wunschunternehmen!G32","v":" - Optional -"},null,{"$f":"IF(OR(C200=\" - Optional -\",C200=0),\"keine Angabe\",C200)","v":"keine Angabe"},{"$f":"IF(OR(C200=\" - Optional -\",C200=0),\"\",C200)","v":""},null,null,"Marketing, Werbung und Public Relation"]
["DESIREDINDUSTRY2","WUN2 Branche",{"$f":"Wunschunternehmen!G34","v":" - Bitte auswählen -"},null,{"$f":"IF(OR(C201=\" - Bitte auswählen -\",C201=0),\"keine Angabe\",IF(C201=\"Gen- und Biotechnologie\",\"Bio- und Gentechnologie\",IF(C201=\"Event- und Kulturmanagement\",\"Kultur- und Eventmanagement\",IF(C201=\"Wirtschaftsprüfung und Steuerberatung\",\"Steuerberatung und Wirtschaftsprüfung\",IF(OR(C201=\"Public Relation, Werbung und Marketing\",C201=\"Marketing, Werbung und Public Relation\"),\"Werbung, Public Relation und Marketing\",C201)))))","v":"keine Angabe"},{"$f":"IF(OR(C201=0,C201=\" - Bitte auswählen -\"),\"\",VLOOKUP(C201,Aufschlüsselung!$X$2:$Y$76,2,FALSE))","v":""}]
["DESIREDCITY2","WUN2 Standort",{"$f":"Wunschunternehmen!G42","v":" - Bitte auswählen -"},null,{"$f":"IF(OR(C202=\" - Bitte auswählen -\",C202=0),\"keine Angabe\",C202)","v":"keine Angabe"},{"$f":"IF(OR(C202=\" - Bitte auswählen -\",C202=0),\"\",C202)","v":""}]
["DESIREDPOSITION2","WUN2 Position",{"$f":"Wunschunternehmen!G36","v":" - Bitte auswählen -"},null,{"$f":"IF(OR(C203=\" - Bitte auswählen -\",C203=\" - Bitte zuerst Fachbereich auswählen -\",C203=0),\"keine Angabe\",IF(C203=\"Syndikus/_Justiziar\",\"Justiziar/_Syndikus\",IF(C203=\"Wirtschaftsprüfungsassistent/_Steuerassistent\",\"Steuerassistent/_Wirtschaftsprüfungsassistent\",C203)))","v":"keine Angabe"},{"$f":"VLOOKUP(C203,Aufschlüsselung!AC2:AD50,2,FALSE)","v":""},null,"Position Doppelte Werte!"]
["DESIREDFOACTION2","WUN2 Tätigkeitsbereich",{"$f":"Wunschunternehmen!G38","v":" - Bitte auswählen -"},null,{"$f":"IF(OR(C204=\" - Bitte auswählen -\",C204=\" - Bitte zuerst Position auswählen -\",C204=0),\"keine Angabe\",IF(C204=\"Public Relation und Unternehmenskommunikation\",\"Unternehmenskommunikation und Public Relation\",IF(C204=\"Steuer- und Wirtschaftsprüfung\",\"Wirtschafts- und Steuerprüfung\",C204)))","v":"keine Angabe"},{"$f":"VLOOKUP(C204,Aufschlüsselung!BE2:BF76,2,FALSE)","v":""},null,"Justiziar/_Syndikus","Syndikus/_Justiziar"]
[null,"WUN2 Unternehmensgröße",{"$f":"Wunschunternehmen!G40","v":" - Bitte auswählen -"},null,{"$f":"IF(OR(C205=\" - Bitte auswählen -\",C205=0),\"keine Angabe\",C205)","v":"keine Angabe"},null,null,"Steuerassistent/_Wirtschaftsprüfungsassistent","Wirtschaftsprüfungsassistent/_Steuerassistent"]
["DESIREDCOMPANY3","WUN3 Name",{"$f":"Wunschunternehmen!D49","v":" - Optional -"},null,{"$f":"IF(OR(C206=\" - Optional -\",C206=0),\"keine Angabe\",C206)","v":"keine Angabe"},{"$f":"IF(OR(C206=\" - Optional -\",C206=0),\"\",C206)","v":""}]
["DESIREDINDUSTRY3","WUN3 Branche",{"$f":"Wunschunternehmen!D51","v":" - Bitte auswählen -"},null,{"$f":"IF(OR(C207=\" - Bitte auswählen -\",C207=0),\"keine Angabe\",IF(C207=\"Gen- und Biotechnologie\",\"Bio- und Gentechnologie\",IF(C207=\"Event- und Kulturmanagement\",\"Kultur- und Eventmanagement\",IF(C207=\"Wirtschaftsprüfung und Steuerberatung\",\"Steuerberatung und Wirtschaftsprüfung\",IF(OR(C207=\"Public Relation, Werbung und Marketing\",C207=\"Marketing, Werbung und Public Relation\"),\"Werbung, Public Relation und Marketing\",C207)))))","v":"keine Angabe"},{"$f":"IF(OR(C207=0,C207=\" - Bitte auswählen -\"),\"\",VLOOKUP(C207,Aufschlüsselung!$X$2:$Y$76,2,FALSE))","v":""}]
["DESIREDCITY3","WUN3 Standort",{"$f":"Wunschunternehmen!D59","v":" - Bitte auswählen -"},null,{"$f":"IF(OR(C208=\" - Bitte auswählen -\",C208=0),\"keine Angabe\",C208)","v":"keine Angabe"},{"$f":"IF(OR(C208=\" - Bitte auswählen -\",C208=0),\"\",C208)","v":""}]
["DESIREDPOSITION3","WUN3 Position",{"$f":"Wunschunternehmen!D53","v":" - Bitte auswählen -"},null,{"$f":"IF(OR(C209=\" - Bitte auswählen -\",C209=\" - Bitte zuerst Fachbereich auswählen -\",C209=0),\"keine Angabe\",IF(C209=\"Syndikus/_Justiziar\",\"Justiziar/_Syndikus\",IF(C209=\"Wirtschaftsprüfungsassistent/_Steuerassistent\",\"Steuerassistent/_Wirtschaftsprüfungsassistent\",C209)))","v":"keine Angabe"},{"$f":"VLOOKUP(C209,Aufschlüsselung!AC2:AD50,2,FALSE)","v":""},null,"Tätigkeitsbereich Doppelte Werte!"]
["DESIREDFOACTION3","WUN3 Tätigkeitsbereich",{"$f":"Wunschunternehmen!D55","v":" - Bitte auswählen -"},null,{"$f":"IF(OR(C210=\" - Bitte auswählen -\",C210=\" - Bitte zuerst Position auswählen -\",C210=0),\"keine Angabe\",IF(C210=\"Public Relation und Unternehmenskommunikation\",\"Unternehmenskommunikation und Public Relation\",IF(C210=\"Steuer- und Wirtschaftsprüfung\",\"Wirtschafts- und Steuerprüfung\",C210)))","v":"keine Angabe"},{"$f":"VLOOKUP(C210,Aufschlüsselung!BE2:BF76,2,FALSE)","v":""},null,"Unternehmenskommunikation und Public Relation","Public Relation und Unternehmenskommunikation"]
[null,"WUN3 Unternehmensgröße",{"$f":"Wunschunternehmen!D57","v":" - Bitte auswählen -"},null,{"$f":"IF(OR(C211=\" - Bitte auswählen -\",C211=0),\"keine Angabe\",C211)","v":"keine Angabe"},null,null,"Wirtschafts- und Steuerprüfung","Steuer- und Wirtschaftsprüfung"]
["DESIREDCOMPANY4","WUN4 Name",{"$f":"Wunschunternehmen!G49","v":" - Optional -"},null,{"$f":"IF(OR(C212=\" - Optional -\",C212=0),\"keine Angabe\",C212)","v":"keine Angabe"},{"$f":"IF(OR(C212=\" - Optional -\",C212=0),\"\",C212)","v":""}]
["DESIREDINDUSTRY4","WUN4 Branche",{"$f":"Wunschunternehmen!G51","v":" - Bitte auswählen -"},null,{"$f":"IF(OR(C213=\" - Bitte auswählen -\",C213=0),\"keine Angabe\",IF(C213=\"Gen- und Biotechnologie\",\"Bio- und Gentechnologie\",IF(C213=\"Event- und Kulturmanagement\",\"Kultur- und Eventmanagement\",IF(C213=\"Wirtschaftsprüfung und Steuerberatung\",\"Steuerberatung und Wirtschaftsprüfung\",IF(OR(C213=\"Public Relation, Werbung und Marketing\",C213=\"Marketing, Werbung und Public Relation\"),\"Werbung, Public Relation und Marketing\",C213)))))","v":"keine Angabe"},{"$f":"IF(OR(C213=0,C213=\" - Bitte auswählen -\"),\"\",VLOOKUP(C213,Aufschlüsselung!$X$2:$Y$76,2,FALSE))","v":""}]
["DESIREDCITY4","WUN4 Standort",{"$f":"Wunschunternehmen!G59","v":" - Bitte auswählen -"},null,{"$f":"IF(OR(C214=\" - Bitte auswählen -\",C214=0),\"keine Angabe\",C214)","v":"keine Angabe"},{"$f":"IF(OR(C214=\" - Bitte auswählen -\",C214=0),\"\",C214)","v":""}]
["DESIREDPOSITION4","WUN4 Position",{"$f":"Wunschunternehmen!G53","v":" - Bitte auswählen -"},null,{"$f":"IF(OR(C215=\" - Bitte auswählen -\",C215=\" - Bitte zuerst Fachbereich auswählen -\",C215=0),\"keine Angabe\",IF(C215=\"Syndikus/_Justiziar\",\"Justiziar/_Syndikus\",IF(C215=\"Wirtschaftsprüfungsassistent/_Steuerassistent\",\"Steuerassistent/_Wirtschaftsprüfungsassistent\",C215)))","v":"keine Angabe"},{"$f":"VLOOKUP(C215,Aufschlüsselung!AC2:AD50,2,FALSE)","v":""}]
["DESIREDFOACTION4","WUN4 Tätigkeitsbereich",{"$f":"Wunschunternehmen!G55","v":" - Bitte auswählen -"},null,{"$f":"IF(OR(C216=\" - Bitte auswählen -\",C216=\" - Bitte zuerst Position auswählen -\",C216=0),\"keine Angabe\",IF(C216=\"Public Relation und Unternehmenskommunikation\",\"Unternehmenskommunikation und Public Relation\",IF(C216=\"Steuer- und Wirtschaftsprüfung\",\"Wirtschafts- und Steuerprüfung\",C216)))","v":"keine Angabe"},{"$f":"VLOOKUP(C216,Aufschlüsselung!BE2:BF76,2,FALSE)","v":""}]
[null,"WUN4 Unternehmensgröße",{"$f":"Wunschunternehmen!G57","v":" - Bitte auswählen -"},null,{"$f":"IF(OR(C217=\" - Bitte auswählen -\",C217=0),\"keine Angabe\",C217)","v":"keine Angabe"}]
["DESIREDSALARY","<Gehaltsvorstellung von>",{"$f":"Wunschunternehmen!D63","v":0},null,null,{"$f":"IF(AND(C219<>0,C218>C219),IF(C219=0,\"\",C219),IF(C218=0,\"\",C218))","v":""}]
["DESIREDSALARYUPTO","<Gehaltsvorstellung bis>",{"$f":"Wunschunternehmen!G63","v":0},null,null,{"$f":"IF(C219<C218,C218,IF(AND(C218<>\"\",C219=0),IF(C218=0,\"\",C218),IF(C219=0,\"\",C219)))","v":""}]
["LASTCOMPANYNAME"]
["LASTINDUSTRY"]
["DURATIONLASTCOMPANY"]
["LASTPOSITION"]
["LASTSTAFFRESPONSIBILITY"]
["LASTBUDGETRESPONSIBILITY"]
["LASTFIELDOFACTION"]
["LASTTOTALSALARY"]
["LASTTOTALSALARYDATE"]
["OCCUPATIONSTATE","<Tätigkeitsstatus>",null,null,null,{"$f":"IF(F15=1,10,9)","v":10}]
["EDUTYPE","<Ausbildungsart>",null,null,null,1]
["QNADDINFO"]
[]
[]
[]
[]
["Praktika-Masterdatei"]
["Arbeitgeber","Unternehmensgröße","Branche","Bereich","Ort des Unternehmens","Hochschulart","Fachbereich","Studiengang","Abschluss","Gehalt / Monat","Dauer (in Monaten)","Datum Praktikum","Position","Fragebogennr."]
[{"$f":"IF(C83=0,\"\",C83)","v":""},null,{"$f":"IF(OR(C85=0,C85=\" - Bitte auswählen -\"),\"\",C85)","v":""},null,{"$f":"IF(OR(C84=0,C84=\" - Bitte auswählen -\"),\"\",C84)","v":""},{"$f":"IF(OR(C21=0,C21=\" - Bitte auswählen -\"),\"\",C21)","v":""},{"$f":"IF(OR(C25=0,C25=\" - Bitte auswählen -\"),\"\",C25)","v":""},{"$f":"IF(OR(C24=0,C24=\" - Bitte auswählen -\"),\"\",C24)","v":""},{"$f":"IF(OR(C28=0,C28=\" - Bitte auswählen -\"),\"\",C28)","v":""},{"$f":"IF(C88=\"\",\"keine Angabe\",C88)","v":"keine Angabe"},{"$f":"F87","v":""},{"$f":"IF(C89=0,\"\",C89)","v":""},{"$f":"IF(Qualifikation!O45=\"\",\"Praktikant\",Qualifikation!O45)","v":"Praktikant"},{"$f":"TEXT(NOW(),\"TTMMJJJJ hhmmss\")","v":"07022020 212448"}]
[{"$f":"IF(C90=0,\"\",C90)","v":""},null,{"$f":"IF(OR(C92=0,C92=\" - Bitte auswählen -\"),\"\",C92)","v":""},null,{"$f":"IF(OR(C91=0,C91=\" - Bitte auswählen -\"),\"\",C91)","v":""},{"$f":"IF(OR(C21=0,C21=\" - Bitte auswählen -\"),\"\",C21)","v":""},{"$f":"IF(OR(C25=0,C25=\" - Bitte auswählen -\"),\"\",C25)","v":""},{"$f":"IF(OR(C24=0,C24=\" - Bitte auswählen -\"),\"\",C24)","v":""},{"$f":"IF(OR(C28=0,C28=\" - Bitte auswählen -\"),\"\",C28)","v":""},{"$f":"IF(C95=\"\",\"keine Angabe\",C95)","v":"keine Angabe"},{"$f":"F94","v":""},{"$f":"IF(C96=0,\"\",C96)","v":""},{"$f":"IF(Qualifikation!O47=\"\",\"Praktikant\",Qualifikation!O47)","v":"Praktikant"},{"$f":"TEXT(NOW(),\"TTMMJJJJ hhmmss\")","v":"07022020 212448"}]
[{"$f":"IF(C97=0,\"\",C97)","v":""},null,{"$f":"IF(OR(C99=0,C99=\" - Bitte auswählen -\"),\"\",C99)","v":""},null,{"$f":"IF(OR(C98=0,C98=\" - Bitte auswählen -\"),\"\",C98)","v":""},{"$f":"IF(OR(C21=0,C21=\" - Bitte auswählen -\"),\"\",C21)","v":""},{"$f":"IF(OR(C25=0,C25=\" - Bitte auswählen -\"),\"\",C25)","v":""},{"$f":"IF(OR(C24=0,C24=\" - Bitte auswählen -\"),\"\",C24)","v":""},{"$f":"IF(OR(C28=0,C28=\" - Bitte auswählen -\"),\"\",C28)","v":""},{"$f":"IF(C102=\"\",\"keine Angabe\",C102)","v":"keine Angabe"},{"$f":"F101","v":""},{"$f":"IF(C103=0,\"\",C103)","v":""},{"$f":"IF(Qualifikation!O49=\"\",\"Praktikant\",Qualifikation!O49)","v":"Praktikant"},{"$f":"TEXT(NOW(),\"TTMMJJJJ hhmmss\")","v":"07022020 212448"}]
[{"$f":"IF(C104=0,\"\",C104)","v":""},null,{"$f":"IF(OR(C106=0,C106=\" - Bitte auswählen -\"),\"\",C106)","v":""},null,{"$f":"IF(OR(C105=0,C105=\" - Bitte auswählen -\"),\"\",C105)","v":""},{"$f":"IF(OR(C21=0,C21=\" - Bitte auswählen -\"),\"\",C21)","v":""},{"$f":"IF(OR(C25=0,C25=\" - Bitte auswählen -\"),\"\",C25)","v":""},{"$f":"IF(OR(C24=0,C24=\" - Bitte auswählen -\"),\"\",C24)","v":""},{"$f":"IF(OR(C28=0,C28=\" - Bitte auswählen -\"),\"\",C28)","v":""},{"$f":"IF(C109=\"\",\"keine Angabe\",C109)","v":"keine Angabe"},{"$f":"F108","v":""},{"$f":"IF(C110=0,\"\",C110)","v":""},{"$f":"IF(Qualifikation!O51=\"\",\"Praktikant\",Qualifikation!O51)","v":"Praktikant"},{"$f":"TEXT(NOW(),\"TTMMJJJJ hhmmss\")","v":"07022020 212448"}]
[]
["GDB-Masterdatei"]
["leer","leer","m/w","leer (da Geb oder Alter)","Text (tt.mm.jjjj)"," 1 Student/ 2 Absolvent","1 Kunde, 2 bereits Interessent","ja","Heute (tt.mm.jjjj)","30 MLP-Kunde","ja/nein","Code","Hochschulname (Codes, aber Textfeld)","Hochschulort (Codes, aber Textfeld)","Code","Code","leer","Text (Zahl)","Code","leer","Text (Zahl)","Code","defaut (0 keine)","leer","leer","leer","default (0 kein)","leer","leer","default (0 keine oder 10 unbekannt)","leer","leer","Code (0 keine)","Text","Text","leer","Text (Zahl)","leer","Code","Text","Text","leer","Text (Zahl)","leer","Code","Code","Code (default: 6 kein Eintrag)","Code","Code (default: 6 kein Eintrag)","Code","Code (default: 6 kein Eintrag)","Code","Code (default: 6 kein Eintrag)","leer","leer","leer","Text (Zahl)","leer","Code","leer","Text (Zahl)","leer","Code","leer","Text (Zahl)","leer","Code","Text","Text","Text","Text","leer","Text (Zahl)","Text (Zahl)","Text (tt.mm.jjjj)","Text","Text","leer","Text (Zahl)","Text (Zahl)","Text (tt.mm.jjjj)","Text","Text","leer","Text (Zahl)","Text (Zahl)","Text (tt.mm.jjjj)","Text","Text","leer","Text (Zahl)","Text (Zahl)","Text (tt.mm.jjjj)","leer","leer","leer","leer","leer","leer","leer","leer","leer","leer","leer","leer","Text (0)","leer","leer","leer","leer","leer","leer","leer","leer","leer","leer","default (0 Jahre-Berufserfahrung)","leer","leer","leer","leer","leer","leer","default (17 unbekannt)","leer","leer","leer","leer","leer","leer","leer","leer","leer","leer","leer","leer","leer","leer","leer","leer","leer","leer","leer","leer","leer","leer","leer","leer","leer","leer","leer","leer","leer","leer","leer","leer","leer","leer","leer","leer","leer","leer","leer","leer","leer","leer","leer","leer","leer","leer","leer","leer","leer","leer","leer","leer","Text","Code","Text","Code","Code","Text","Code","Text","Code","Code","Text","Code","Text","Code","Code","Text","Code","Text","Code","Code","Text (Zahl)","Text (Zahl)","leer","leer","leer","leer","leer","leer","leer","leer","leer","9 unbekannt/ 10 Student","1 akademisch","leer"]
["./.","./.","Geschlecht","./.","Geburtsdatum","Karrierephase","PersonenGruppe","Berufseinsteiger","Veröffentlichungsdatum","Quelle der Daten","Doppelstudium","Hochschulart","Hochschulname","Hochschulort","Studiengang","Fachbereich","Schwerpunkt","Studiendauer","Erster Abschluß","Vordiplomnote","Examensnote","Promotionsbewertung","Hochschulart 2","Hochschulname 2","Hochschulort 2","Studiengang 2","Fachbereich 2","Schwerpunkt 2","Studiendauer 2","Zweiter Abschluß","Vordiplomnote 2","Examensnote 2","Promotionsbewertung 2","Hochschulname/Institutionsname","Zusatzqualifikation","Fachrichtung","Dauer","Ort","Land","Hochschulname/Institutionsname2","Zusatzqual. Bezeichung 2","Fachrichtung2","Dauer2","Ort2","Land2","Sprache 1","Sprache-Skills1","Sprache 2","Sprache-Skills2","Sprache 3","Sprache-Skills3","Sprache 4","Sprache-Skills4","Sprache 5","Sprache-Skills5","Hochschulname 1","Dauer 1 (Semester)","Ort 1","Land 1","Hochschulname 2","Dauer 2 (Semester)","Ort 2","Land 2","Hochschulname 3","Dauer 3 (Semester)","Ort 3","Land 3","Ausbildung Bezeichnung 1","Bezeichnung 2","Praktika Arbeitgeber 1","Einsatzort 1","Bereich 1","Dauer 1 (in Monaten)","Gehalt 1","Startdatum 1","Praktika  Arbeitgeber 2","Einsatzort 2","Bereich 2","Dauer 2 (in Monaten)","Gehalt 2","Startdatum 2","Praktika Arbeitgeber 3","Einsatzort 3","Bereich 3","Dauer 3 (in Monaten)","Gehalt 3","Startdatum 3","Praktika Arbeitgeber 4","Einsatzort 4","Bereich 4","Dauer 4 (in Monaten)","Gehalt 4","Startdatum 4","Arbeitgeber 5","Einsatzort 5","Bereich 5","Dauer 5 (in Monaten)","Startdatum 5","Gehalt 5","Arbeitgeber 6","Einsatzort 6","Bereich 6","Dauer 6 (in Monaten)","Startdatum 6","Gehalt 6","Berufserfahrung Insgesamt",{"$error":"#N/A"},{"$error":"#N/A"},{"$error":"#N/A"},{"$error":"#N/A"},{"$error":"#N/A"},{"$error":"#N/A"},{"$error":"#N/A"},{"$error":"#N/A"},{"$error":"#N/A"},"Firma","Gesellschaftsform","Branche","Anzahl Beschäftigte weltweit ",{"$error":"#N/A"},"Anzahl der Beschäftigten Standort (aktuelle Firma)","Postleitzahl","Stadt","Bundesland","Land",{"$error":"#N/A"},{"$error":"#N/A"},{"$error":"#N/A"},{"$error":"#N/A"},"Aktuelle Position","Aktueller Tätigkeitsbereich",{"$error":"#N/A"},"Seit wann sind Sie in der dieser Position",{"$error":"#N/A"},{"$error":"#N/A"},{"$error":"#N/A"},{"$error":"#N/A"},{"$error":"#N/A"},{"$error":"#N/A"},{"$error":"#N/A"},{"$error":"#N/A"},{"$error":"#N/A"},{"$error":"#N/A"},{"$error":"#N/A"},{"$error":"#N/A"},{"$error":"#N/A"},{"$error":"#N/A"},{"$error":"#N/A"},{"$error":"#N/A"},{"$error":"#N/A"},{"$error":"#N/A"},{"$error":"#N/A"},{"$error":"#N/A"},{"$error":"#N/A"},{"$error":"#N/A"},{"$error":"#N/A"},{"$error":"#N/A"},{"$error":"#N/A"},{"$error":"#N/A"},{"$error":"#N/A"},{"$error":"#N/A"},{"$error":"#N/A"},{"$error":"#N/A"},{"$error":"#N/A"},{"$error":"#N/A"},{"$error":"#N/A"},{"$error":"#N/A"},{"$error":"#N/A"},{"$error":"#N/A"},{"$error":"#N/A"},{"$error":"#N/A"},{"$error":"#N/A"},{"$error":"#N/A"},{"$error":"#N/A"},{"$error":"#N/A"},{"$error":"#N/A"},"Wunschunternehmen 1","Wunschbranche 1","Wunscheinsatzort 1","Wunschposition 1","Wunschtätigkeitsbereich 1","Wunschunternehmen 2","Wunschbranche 2","Wunscheinsatzort 2","Wunschposition 2","Wunschtätigkeitsbereich 2","Wunschunternehmen 3","Wunschbranche 3","Wunscheinsatzort 3","Wunschposition 3","Wunschtätigkeitsbereich 3","Wunschunternehmen 4","Wunschbranche 4","Wunscheinsatzort 4","Wunschposition 4","Wunschtätigkeitsbereich 4","Wunschgehalt von","Wunschgehalt bis",{"$error":"#N/A"},{"$error":"#N/A"},{"$error":"#N/A"},{"$error":"#N/A"},{"$error":"#N/A"},{"$error":"#N/A"},{"$error":"#N/A"},{"$error":"#N/A"},{"$error":"#N/A"},"Tätigkeitsstatus","Ausbildungsart",{"$error":"#N/A"},"Fragebogennr."]
["BPISALARYID","QUESTIONNAIREID","SEX","AGE","BIRTHDATE","CAREERPHASE","CUSTGROUP","JOBSTARTER","ENTERDATE","SOURCE","DOUBLEDEGREE","INSTITUTETYPE","INSTITUTE","EDUCITY","STUDYCOURSE","FACULTY","FIRSTMAJORFIELD","FIRSTDURATION","FIRSTDEGREE","INTEREXAMGRADE1","EXAMGRADE1","FIRSTPHDGRADE","INSTITUTETYPE2","INSTITUTE2","EDUCITY2","STUDYCOURSE2","FACULTY2","SECONDMAJORFIELD","SECONDDURATION","SECONDDEGREE","INTEREXAMGRADE2","EXAMGRADE2","SECONDPHDGRADE","ADDSKILLINSTITUTE","ADDITONALSKILL","ADDSKILLSPECIAL","ADDITONALSKILLDURATION","ADDSKILLCITY","ADDSKILLCOUNTRY","ADDSKILLINSTITUTE2","ADDITIONALSKILL2","ADDSKILLSPECIAL2","ADDSKILLDURATION2","ADDSKILLCITY2","ADDSKILLCOUNTRY2","LANGUAGE1","LANGSKILL1","LANGUAGE2","LANGSKILL2","LANGUAGE3","LANGSKILL3","LANGUAGE4","LANGSKILL4","LANGUAGE5","LANGSKILL5","SEMABROADINSTITUTE1","SEMABROADDURATION1","SEMABROADCITY1","SEMABROADCOUNTRY1","SEMABROADINSTITUTE2","SEMABROADDURATION2","SEMABROADCITY2","SEMABROADCOUNTRY2","SEMABROADINSTITUTE3","SEMABROADDURATION3","SEMABROADCITY3","SEMABROADCOUNTRY3","EDUDESCRIPTION1","EDUDESCRIPTION2","COMPANYNAME1","CITY1","FOACTION1","INTERNSHIPDURATION1","INTERNSHIPSALARY1","INTERNSHIPSTARTDATE1","COMPANYNAME2","CITY2","FOACTION2","INTERNSHIPDURATION2","INTERNSHIPSALARY2","INTERNSHIPSTARTDATE2","COMPANYNAME3","CITY3","FOACTION3","INTERNSHIPDURATION3","INTERNSHIPSALARY3","INTERNSHIPSTARTDATE3","COMPANYNAME4","CITY4","FOACTION4","INTERNSHIPDURATION4","INTERNSHIPSALARY4","INTERNSHIPSTARTDATE4","COMPANYNAME5","CITY5","FOACTION5","INTERNSHIPDURATION5","INTERNSHIPSALARY5","INTERNSHIPSTARTDATE5","COMPANYNAME6","CITY6","FOACTION6","INTERNSHIPDURATION6","INTERNSHIPSALARY6","INTERNSHIPSTARTDATE6","WORKEXPERIENCE","YEARSWEXPNATIONAL","YEARSWEXPABROAD","WORKEXPCOUNTRY1","WORKEXPDURATION1","WORKEXPCOUNTRY2","WORKEXPDURATION2","WORKEXPCOUNTRY3","WORKEXPDURATION3","EMPLOYERCHGCOUNT","COMPANYNAME","LEGALFORM","INDUSTRY","STAFFSIZENATIONAL","STAFFSIZEWORLD","STAFFSIZELOCAL","POSTCODE","CITY","FEDERALSTATE","COUNTRY","ENTRYDATE","WORKHOURS","REALWORKHOURSFROM","REALWORKHOURSTO","ENTRYPOSITION","ENTRYFIELDOFACTION","CURRENTPOSITION","ENTRYDATECURRENTPOSITION","FIELDOFACTION","STAFFRESPONSIBILITY","BASESALARY","SALARYCOUNT","VACATIONBONUS","CHRISTMASBONUS","SALARY","BONUS","BONUSUPTO","BONUSGUARANTEED","CMPNYPAYEDPENSION","COMPANYCAR","CCPRIVATUSE","CCALLOWBUDGET","CCBUDGETGROSS","CAPITALFORMPAYMENT","OTHERNCBDESC","OTHERNCBAMOUNT","EDUFINANCINGAMOUNT","ADDCNTRBDESC","ADDCNTRBAMOUNT","VARSALARYEXWU","VARIABLESALARYUPTO","VARIABLESALARY","VARIABLESALARYUPTO","TOTALSALARY","TOTALSALARYUPTO","TOTALGURANTEEDSALARY","SALARYTARIFF","BUDGETRESPONSIBILITY","ENTRYSALARY","LASTSALARYINCDATE","LASTSALARYINCREASEAMOUNT","LASTSALARYINCPERCENT","LASTSALARYINCTOTAL","SECONDSALARYINCDATE","SECONDSALARYINCREASEAMOUNT","SECONDSALARYINCPERCENT","SECONDSALARYINCTOTAL","THIRDSALARYINCDATE","THIRDSALARYINCREASEAMOUNT","THIRDSALARYINCPERCENT","THIRDSALARYINCTOTAL","DESIREDCOMPANY1","DESIREDINDUSTRY1","DESIREDCITY1","DESIREDPOSITION1","DESIREDFOACTION1","DESIREDCOMPANY2","DESIREDINDUSTRY2","DESIREDCITY2","DESIREDPOSITION2","DESIREDFOACTION2","DESIREDCOMPANY3","DESIREDINDUSTRY3","DESIREDCITY3","DESIREDPOSITION3","DESIREDFOACTION3","DESIREDCOMPANY4","DESIREDINDUSTRY4","DESIREDCITY4","DESIREDPOSITION4","DESIREDFOACTION4","DESIREDSALARY","DESIREDSALARYUPTO","LASTCOMPANYNAME","LASTINDUSTRY","DURATIONLASTCOMPANY","LASTPOSITION","LASTSTAFFRESPONSIBILITY","LASTBUDGETRESPONSIBILITY","LASTFIELDOFACTION","LASTTOTALSALARY","LASTTOTALSALARYDATE","OCCUPATIONSTATE","EDUTYPE","QNADDINFO"]
[" ",null,{"$f":"F12","v":"m"},null,{"$f":"F14","v":""},{"$f":"F15","v":1},{"$f":"F16","v":2},"ja",{"$f":"TODAY()","v":"2020-02-07"},30,{"$f":"F20","v":"nein"},{"$f":"F21","v":0},{"$f":"F22","v":""},{"$f":"F23","v":""},{"$f":"F24","v":""},{"$f":"F25","v":"0"},null,{"$f":"F27","v":""},{"$f":"F28","v":"10"},null,{"$f":"F30","v":""},{"$f":"F31","v":0},0,null,null,null,0,null,null,10,null,null,{"$f":"F31","v":0},{"$f":"F45","v":""},{"$f":"F46","v":""},null,{"$f":"F48","v":""},null,{"$f":"F50","v":""},{"$f":"F51","v":""},{"$f":"F52","v":""},null,{"$f":"F54","v":""},null,{"$f":"F56","v":""},{"$f":"F57","v":""},{"$f":"F58","v":6},{"$f":"F59","v":""},{"$f":"F60","v":6},{"$f":"F61","v":""},{"$f":"F62","v":6},{"$f":"F63","v":""},{"$f":"F64","v":6},null,{"$f":"F66","v":6},null,{"$f":"F68","v":""},null,{"$f":"F70","v":""},null,{"$f":"F72","v":""},null,{"$f":"F74","v":""},null,{"$f":"F76","v":""},null,{"$f":"F78","v":""},{"$f":"F79","v":""},{"$f":"F80","v":""},{"$f":"F83","v":""},{"$f":"F84","v":""},null,{"$f":"F87","v":""},{"$f":"F88","v":""},{"$f":"F89","v":""},{"$f":"F90","v":""},{"$f":"F91","v":""},null,{"$f":"F94","v":""},{"$f":"F95","v":""},{"$f":"F96","v":""},{"$f":"F97","v":""},{"$f":"F98","v":""},null,{"$f":"F101","v":""},{"$f":"F102","v":""},{"$f":"F103","v":""},{"$f":"F104","v":""},{"$f":"F105","v":""},null,{"$f":"F108","v":""},{"$f":"F109","v":""},{"$f":"F110","v":""},null,null,null,null,null,null,null,null,null,null,null,null,0,null,null,null,null,null,null,null,null,null,null,13,null,null,null,null,null,null,17,null,null,null,null,null,null,null,null,null,null,null,null,null,null,null,null,null,null,null,null,null,null,null,null,null,null,null,null,null,null,null,null,null,null,null,null,null,null,null,null,null,null,null,null,null,null,null,null,null,null,null,null,{"$f":"F194","v":""},{"$f":"F195","v":""},{"$f":"F196","v":""},{"$f":"F197","v":""},{"$f":"F198","v":""},{"$f":"F200","v":""},{"$f":"F201","v":""},{"$f":"F202","v":""},{"$f":"F203","v":""},{"$f":"F204","v":""},{"$f":"F206","v":""},{"$f":"F207","v":""},{"$f":"F208","v":""},{"$f":"F209","v":""},{"$f":"F210","v":""},{"$f":"F212","v":""},{"$f":"F213","v":""},{"$f":"F214","v":""},{"$f":"F215","v":""},{"$f":"F216","v":""},{"$f":"F218","v":""},{"$f":"F219","v":""},null,null,null,null,null,null,null,null,null,{"$f":"F229","v":10},1,null,{"$f":"TEXT(NOW(),\"TTMMJJJJ hhmmss\")","v":"07022020 212448"}]

{"sheet":"Kombination","index":8,"n_rows":2286,"n_cols":18,"rows_kept":2286,"cut":false,"hidden":true,"merged":[]}
[null,null,null,null,null,null,null,{"$f":"OFFSET(H11,,,H7,)","v":{"$error":"#REF!"}},null,null,{"$f":"OFFSET($K$11,,,$K$7,)","v":{"$error":"#REF!"}},null,null,{"$f":"OFFSET($N$11,,,$N$7,)","v":{"$error":"#REF!"}},null,null,{"$f":"OFFSET($Q$11,,,$Q$7,)","v":{"$error":"#REF!"}}]
[]
["Fachbereich","Position","Verkettung FB-Pos","Tätigkeitsbereich","Einschränkung Nawi TB",null,"FB:",{"$f":"'Ausbildung '!E28","v":" - Bitte auswählen -"}]
["Geistes_und_Sozialwissenschaften","Account_Manager",{"$f":"A4&B4&E4","v":"Geistes_und_SozialwissenschaftenAccount_Manager"},"Account Management"]
["Geistes_und_Sozialwissenschaften","Assistent_der_Geschäftsleitung/_des_Vorstands",{"$f":"A5&B5&E5","v":"Geistes_und_SozialwissenschaftenAssistent_der_Geschäftsleitung/_des_Vorstands"},"Assistenz der Geschäftsleitung/ des Vorstands",null,null,"Pos1:",{"$f":"IF(AND(OR(Wunschunternehmen!D36=\"Projektmitarbeiter\",Wunschunternehmen!D36=\"Projektleiter/_Projektmanager\",Wunschunternehmen!D36=\"Mitarbeiter\",Wunschunternehmen!D36=\"Trainee\"),OR('Ausbildung '!E30=\"Naturwissenschaften allgemein\",AND('Ausbildung '!E28=\"Naturwissenschaften\",'Ausbildung '!E30=\"Psychologie\"))),Wunschunternehmen!D36&\"allg_Psy\",IF(AND(OR(Wunschunternehmen!D36=\"Controller\",Wunschunternehmen!D36=\"Mitarbeiter\",Wunschunternehmen!D36=\"Projektleiter/_Projektmanager\",Wunschunternehmen!D36=\"Projektmitarbeiter\",Wunschunternehmen!D36=\"Prüfungsassistent\",Wunschunternehmen!D36=\"Referent\",Wunschunternehmen!D36=\"Trainee\"),OR('Ausbildung '!E30=\"Mathematik\",AND('Ausbildung '!E28=\"Naturwissenschaften\",'Ausbildung '!E30=\"Wirtschaftsmathematik\"))),Wunschunternehmen!D36&\"Mathe_Wmathe\",Wunschunternehmen!D36))","v":" - Bitte auswählen -"},null,"Pos2:",{"$f":"IF(AND(OR(Wunschunternehmen!G36=\"Projektmitarbeiter\",Wunschunternehmen!G36=\"Projektleiter/_Projektmanager\",Wunschunternehmen!G36=\"Mitarbeiter\",Wunschunternehmen!G36=\"Trainee\"),OR('Ausbildung '!E30=\"Naturwissenschaften allgemein\",AND('Ausbildung '!E28=\"Naturwissenschaften\",'Ausbildung '!E30=\"Psychologie\"))),Wunschunternehmen!G36&\"allg_Psy\",IF(AND(OR(Wunschunternehmen!G36=\"Controller\",Wunschunternehmen!G36=\"Mitarbeiter\",Wunschunternehmen!G36=\"Projektleiter/_Projektmanager\",Wunschunternehmen!G36=\"Projektmitarbeiter\",Wunschunternehmen!G36=\"Prüfungsassistent\",Wunschunternehmen!G36=\"Referent\",Wunschunternehmen!G36=\"Trainee\"),OR('Ausbildung '!E30=\"Mathematik\",AND('Ausbildung '!E28=\"Naturwissenschaften\",'Ausbildung '!E30=\"Wirtschaftsmathematik\"))),Wunschunternehmen!G36&\"Mathe_Wmathe\",Wunschunternehmen!G36))","v":" - Bitte auswählen -"},null,"Pos3:",{"$f":"IF(AND(OR(Wunschunternehmen!D53=\"Projektmitarbeiter\",Wunschunternehmen!D53=\"Projektleiter/_Projektmanager\",Wunschunternehmen!D53=\"Mitarbeiter\",Wunschunternehmen!D53=\"Trainee\"),OR('Ausbildung '!E30=\"Naturwissenschaften allgemein\",AND('Ausbildung '!E28=\"Naturwissenschaften\",'Ausbildung '!E30=\"Psychologie\"))),Wunschunternehmen!D53&\"allg_Psy\",IF(AND(OR(Wunschunternehmen!D53=\"Controller\",Wunschunternehmen!D53=\"Mitarbeiter\",Wunschunternehmen!D53=\"Projektleiter/_Projektmanager\",Wunschunternehmen!D53=\"Projektmitarbeiter\",Wunschunternehmen!D53=\"Prüfungsassistent\",Wunschunternehmen!D53=\"Referent\",Wunschunternehmen!D53=\"Trainee\"),OR('Ausbildung '!E30=\"Mathematik\",AND('Ausbildung '!E28=\"Naturwissenschaften\",'Ausbildung '!E30=\"Wirtschaftsmathematik\"))),Wunschunternehmen!D53&\"Mathe_Wmathe\",Wunschunternehmen!D53))","v":" - Bitte auswählen -"},null,"Pos4:",{"$f":"IF(AND(OR(Wunschunternehmen!G53=\"Projektmitarbeiter\",Wunschunternehmen!G53=\"Projektleiter/_Projektmanager\",Wunschunternehmen!G53=\"Mitarbeiter\",Wunschunternehmen!G53=\"Trainee\"),OR('Ausbildung '!E30=\"Naturwissenschaften allgemein\",AND('Ausbildung '!E28=\"Naturwissenschaften\",'Ausbildung '!E30=\"Psychologie\"))),Wunschunternehmen!G53&\"allg_Psy\",IF(AND(OR(Wunschunternehmen!G53=\"Controller\",Wunschunternehmen!G53=\"Mitarbeiter\",Wunschunternehmen!G53=\"Projektleiter/_Projektmanager\",Wunschunternehmen!G53=\"Projektmitarbeiter\",Wunschunternehmen!G53=\"Prüfungsassistent\",Wunschunternehmen!G53=\"Referent\",Wunschunternehmen!G53=\"Trainee\"),OR('Ausbildung '!E30=\"Mathematik\",AND('Ausbildung '!E28=\"Naturwissenschaften\",'Ausbildung '!E30=\"Wirtschaftsmathematik\"))),Wunschunternehmen!G53&\"Mathe_Wmathe\",Wunschunternehmen!G53))","v":" - Bitte auswählen -"}]
["Geistes_und_Sozialwissenschaften","Associate","Geistes_und_SozialwissenschaftenAssociate","Consulting",null,null," => TB1",null,null," => TB2",null,null," => TB3",null,null," => TB4"]
["Geistes_und_Sozialwissenschaften","Associate","Geistes_und_SozialwissenschaftenAssociate","Finanzwesen",null,null," => Anz",{"$f":"COUNTIF(I:I,\"*\")","v":0},null," => Anz",{"$f":"COUNTIF(L:L,\"*\")","v":0},null," => Anz",{"$f":"COUNTIF(O:O,\"*\")","v":0},null," => Anz",{"$f":"COUNTIF(R:R,\"*\")","v":0}]
["Geistes_und_Sozialwissenschaften","Associate","Geistes_und_SozialwissenschaftenAssociate","Strategieentwicklung"]
["Geistes_und_Sozialwissenschaften","Business_Development_Manager","Geistes_und_SozialwissenschaftenBusiness_Development_Manager","Business Development"]
["Geistes_und_Sozialwissenschaften","Consultant","Geistes_und_SozialwissenschaftenConsultant","Business Development",null,null,null,{"$f":"CONCATENATE(H3,H5)","v":" - Bitte auswählen - - Bitte auswählen -"},null,null,{"$f":"CONCATENATE(H3,K5)","v":" - Bitte auswählen - - Bitte auswählen -"},null,null,{"$f":"CONCATENATE(H3,N5)","v":" - Bitte auswählen - - Bitte auswählen -"},null,null,{"$f":"CONCATENATE(H3,Q5)","v":" - Bitte auswählen - - Bitte auswählen -"}]
["Geistes_und_Sozialwissenschaften","Consultant","Geistes_und_SozialwissenschaftenConsultant","Consulting",null,null,null,{"$f":"INDEX(D:D,SMALL(IF(C$1:C$2289=$H$10,ROW($1:$2289)),1))","v":{"$error":"#NUM!"}},{"$f":"IF(ISERROR(H11),0,H11)","v":0},null,{"$f":"INDEX(D:D,SMALL(IF(C$1:C$2289=K10,ROW($1:$2289)),1))","v":{"$error":"#NUM!"}},{"$f":"IF(ISERROR(K11),0,K11)","v":0},null,{"$f":"INDEX(D:D,SMALL(IF(C$1:C$2289=N10,ROW($1:$2289)),1))","v":{"$error":"#NUM!"}},{"$f":"IF(ISERROR(N11),0,N11)","v":0},null,{"$f":"INDEX(D:D,SMALL(IF(C$1:C$2289=Q10,ROW($1:$2289)),1))","v":{"$error":"#NUM!"}},{"$f":"IF(ISERROR(Q11),0,Q11)","v":0}]
["Geistes_und_Sozialwissenschaften","Consultant","Geistes_und_SozialwissenschaftenConsultant","Finanzwesen",null,null,null,{"$f":"INDEX(D:D,SMALL(IF(C$1:C$2289=$H$10,ROW($1:$2289)),2))","v":{"$error":"#NUM!"}},{"$f":"IF(ISERROR(H12),0,H12)","v":0},null,{"$f":"INDEX(D:D,SMALL(IF(C$1:C$2289=K10,ROW($1:$2289)),2))","v":{"$error":"#NUM!"}},{"$f":"IF(ISERROR(K12),0,K12)","v":0},null,{"$f":"INDEX(D:D,SMALL(IF(C$1:C$2289=N10,ROW($1:$2289)),2))","v":{"$error":"#NUM!"}},{"$f":"IF(ISERROR(N12),0,N12)","v":0},null,{"$f":"INDEX(D:D,SMALL(IF(C$1:C$2289=Q10,ROW($1:$2289)),2))","v":{"$error":"#NUM!"}},{"$f":"IF(ISERROR(Q12),0,Q12)","v":0}]
["Geistes_und_Sozialwissenschaften","Consultant","Geistes_und_SozialwissenschaftenConsultant","Strategieentwicklung",null,null,null,{"$f":"INDEX(D:D,SMALL(IF(C$1:C$2289=$H$10,ROW($1:$2289)),3))","v":{"$error":"#NUM!"}},0,null,{"$f":"INDEX(D:D,SMALL(IF(C$1:C$2289=K10,ROW($1:$2289)),3))","v":{"$error":"#NUM!"}},0,null,{"$f":"INDEX(D:D,SMALL(IF(C$1:C$2289=N10,ROW($1:$2289)),3))","v":{"$error":"#NUM!"}},0,null,{"$f":"INDEX(D:D,SMALL(IF(C$1:C$2289=Q10,ROW($1:$2289)),3))","v":{"$error":"#NUM!"}},0]
["Geistes_und_Sozialwissenschaften","Content_Manager","Geistes_und_SozialwissenschaftenContent_Manager","Content Management",null,null,null,{"$f":"INDEX(D:D,SMALL(IF(C$1:C$2289=$H$10,ROW($1:$2289)),4))","v":{"$error":"#NUM!"}},0,null,{"$f":"INDEX(D:D,SMALL(IF(C$1:C$2289=K10,ROW($1:$2289)),4))","v":{"$error":"#NUM!"}},0,null,{"$f":"INDEX(D:D,SMALL(IF(C$1:C$2289=N10,ROW($1:$2289)),4))","v":{"$error":"#NUM!"}},0,null,{"$f":"INDEX(D:D,SMALL(IF(C$1:C$2289=Q10,ROW($1:$2289)),4))","v":{"$error":"#NUM!"}},0]
["Geistes_und_Sozialwissenschaften","Controller","Geistes_und_SozialwissenschaftenController","Controlling",null,null,null,{"$f":"INDEX(D:D,SMALL(IF(C$1:C$2289=$H$10,ROW($1:$2289)),5))","v":{"$error":"#NUM!"}},0,null,{"$f":"INDEX(D:D,SMALL(IF(C$1:C$2289=K10,ROW($1:$2289)),5))","v":{"$error":"#NUM!"}},0,null,{"$f":"INDEX(D:D,SMALL(IF(C$1:C$2289=N10,ROW($1:$2289)),5))","v":{"$error":"#NUM!"}},0,null,{"$f":"INDEX(D:D,SMALL(IF(C$1:C$2289=Q10,ROW($1:$2289)),5))","v":{"$error":"#NUM!"}},0]
["Geistes_und_Sozialwissenschaften","Controller","Geistes_und_SozialwissenschaftenController","Einkauf und Beschaffung",null,null,null,{"$f":"INDEX(D:D,SMALL(IF(C$1:C$2289=$H$10,ROW($1:$2289)),6))","v":{"$error":"#NUM!"}},0,null,{"$f":"INDEX(D:D,SMALL(IF(C$1:C$2289=K10,ROW($1:$2289)),6))","v":{"$error":"#NUM!"}},0,null,{"$f":"INDEX(D:D,SMALL(IF(C$1:C$2289=N10,ROW($1:$2289)),6))","v":{"$error":"#NUM!"}},0,null,{"$f":"INDEX(D:D,SMALL(IF(C$1:C$2289=Q10,ROW($1:$2289)),6))","v":{"$error":"#NUM!"}},0]
["Geistes_und_Sozialwissenschaften","Controller","Geistes_und_SozialwissenschaftenController","Finanzwesen",null,null,null,{"$f":"INDEX(D:D,SMALL(IF(C$1:C$2289=$H$10,ROW($1:$2289)),7))","v":{"$error":"#NUM!"}},0,null,{"$f":"INDEX(D:D,SMALL(IF(C$1:C$2289=K10,ROW($1:$2289)),7))","v":{"$error":"#NUM!"}},0,null,{"$f":"INDEX(D:D,SMALL(IF(C$1:C$2289=N10,ROW($1:$2289)),7))","v":{"$error":"#NUM!"}},0,null,{"$f":"INDEX(D:D,SMALL(IF(C$1:C$2289=Q10,ROW($1:$2289)),7))","v":{"$error":"#NUM!"}},0]
["Geistes_und_Sozialwissenschaften","Controller","Geistes_und_SozialwissenschaftenController","Vertriebssteuerung",null,null,null,{"$f":"INDEX(D:D,SMALL(IF(C$1:C$2289=$H$10,ROW($1:$2289)),8))","v":{"$error":"#NUM!"}},0,null,{"$f":"INDEX(D:D,SMALL(IF(C$1:C$2289=K10,ROW($1:$2289)),8))","v":{"$error":"#NUM!"}},0,null,{"$f":"INDEX(D:D,SMALL(IF(C$1:C$2289=N10,ROW($1:$2289)),8))","v":{"$error":"#NUM!"}},0,null,{"$f":"INDEX(D:D,SMALL(IF(C$1:C$2289=Q10,ROW($1:$2289)),8))","v":{"$error":"#NUM!"}},0]
["Geistes_und_Sozialwissenschaften","Einkäufer","Geistes_und_SozialwissenschaftenEinkäufer","Einkauf und Beschaffung",null,null,null,{"$f":"INDEX(D:D,SMALL(IF(C$1:C$2289=$H$10,ROW($1:$2289)),9))","v":{"$error":"#NUM!"}},0,null,{"$f":"INDEX(D:D,SMALL(IF(C$1:C$2289=K10,ROW($1:$2289)),9))","v":{"$error":"#NUM!"}},0,null,{"$f":"INDEX(D:D,SMALL(IF(C$1:C$2289=N10,ROW($1:$2289)),9))","v":{"$error":"#NUM!"}},0,null,{"$f":"INDEX(D:D,SMALL(IF(C$1:C$2289=Q10,ROW($1:$2289)),9))","v":{"$error":"#NUM!"}},0]
["Geistes_und_Sozialwissenschaften","Einkäufer","Geistes_und_SozialwissenschaftenEinkäufer","Produktmanagement",null,null,null,{"$f":"INDEX(D:D,SMALL(IF(C$1:C$2289=$H$10,ROW($1:$2289)),10))","v":{"$error":"#NUM!"}},0,null,{"$f":"INDEX(D:D,SMALL(IF(C$1:C$2289=K10,ROW($1:$2289)),10))","v":{"$error":"#NUM!"}},0,null,{"$f":"INDEX(D:D,SMALL(IF(C$1:C$2289=N10,ROW($1:$2289)),10))","v":{"$error":"#NUM!"}},0,null,{"$f":"INDEX(D:D,SMALL(IF(C$1:C$2289=Q10,ROW($1:$2289)),10))","v":{"$error":"#NUM!"}},0]
["Geistes_und_Sozialwissenschaften","Event_Manager","Geistes_und_SozialwissenschaftenEvent_Manager","Event Management",null,null,null,{"$f":"INDEX(D:D,SMALL(IF(C$1:C$2289=$H$10,ROW($1:$2289)),11))","v":{"$error":"#NUM!"}},0,null,{"$f":"INDEX(D:D,SMALL(IF(C$1:C$2289=K10,ROW($1:$2289)),11))","v":{"$error":"#NUM!"}},0,null,{"$f":"INDEX(D:D,SMALL(IF(C$1:C$2289=N10,ROW($1:$2289)),11))","v":{"$error":"#NUM!"}},0,null,{"$f":"INDEX(D:D,SMALL(IF(C$1:C$2289=Q10,ROW($1:$2289)),11))","v":{"$error":"#NUM!"}},0]
["Geistes_und_Sozialwissenschaften","Key_Account_Manager","Geistes_und_SozialwissenschaftenKey_Account_Manager","Key Account Management",null,null,null,{"$f":"INDEX(D:D,SMALL(IF(C$1:C$2289=$H$10,ROW($1:$2289)),12))","v":{"$error":"#NUM!"}},0,null,{"$f":"INDEX(D:D,SMALL(IF(C$1:C$2289=K10,ROW($1:$2289)),12))","v":{"$error":"#NUM!"}},0,null,{"$f":"INDEX(D:D,SMALL(IF(C$1:C$2289=N10,ROW($1:$2289)),12))","v":{"$error":"#NUM!"}},0,null,{"$f":"INDEX(D:D,SMALL(IF(C$1:C$2289=Q10,ROW($1:$2289)),12))","v":{"$error":"#NUM!"}},0]
["Geistes_und_Sozialwissenschaften","Marketing_Assistent","Geistes_und_SozialwissenschaftenMarketing_Assistent","Marketing",null,null,null,{"$f":"INDEX(D:D,SMALL(IF(C$1:C$2289=$H$10,ROW($1:$2289)),13))","v":{"$error":"#NUM!"}},0,null,{"$f":"INDEX(D:D,SMALL(IF(C$1:C$2289=K10,ROW($1:$2289)),13))","v":{"$error":"#NUM!"}},0,null,{"$f":"INDEX(D:D,SMALL(IF(C$1:C$2289=N10,ROW($1:$2289)),13))","v":{"$error":"#NUM!"}},0,null,{"$f":"INDEX(D:D,SMALL(IF(C$1:C$2289=Q10,ROW($1:$2289)),13))","v":{"$error":"#NUM!"}},0]
["Geistes_und_Sozialwissenschaften","Marketing_Assistent","Geistes_und_SozialwissenschaftenMarketing_Assistent","Online-Marketing",null,null,null,{"$f":"INDEX(D:D,SMALL(IF(C$1:C$2289=$H$10,ROW($1:$2289)),14))","v":{"$error":"#NUM!"}},0,null,{"$f":"INDEX(D:D,SMALL(IF(C$1:C$2289=K10,ROW($1:$2289)),14))","v":{"$error":"#NUM!"}},0,null,{"$f":"INDEX(D:D,SMALL(IF(C$1:C$2289=N10,ROW($1:$2289)),14))","v":{"$error":"#NUM!"}},0,null,{"$f":"INDEX(D:D,SMALL(IF(C$1:C$2289=Q10,ROW($1:$2289)),14))","v":{"$error":"#NUM!"}},0]
["Geistes_und_Sozialwissenschaften","Mitarbeiter","Geistes_und_SozialwissenschaftenMitarbeiter","Account Management",null,null,null,{"$f":"INDEX(D:D,SMALL(IF(C$1:C$2289=$H$10,ROW($1:$2289)),15))","v":{"$error":"#NUM!"}},0,null,{"$f":"INDEX(D:D,SMALL(IF(C$1:C$2289=K10,ROW($1:$2289)),15))","v":{"$error":"#NUM!"}},0,null,{"$f":"INDEX(D:D,SMALL(IF(C$1:C$2289=N10,ROW($1:$2289)),15))","v":{"$error":"#NUM!"}},0,null,{"$f":"INDEX(D:D,SMALL(IF(C$1:C$2289=Q10,ROW($1:$2289)),15))","v":{"$error":"#NUM!"}},0]
["Geistes_und_Sozialwissenschaften","Mitarbeiter","Geistes_und_SozialwissenschaftenMitarbeiter","Allgemeine Verwaltung",null,null,null,{"$f":"INDEX(D:D,SMALL(IF(C$1:C$2289=$H$10,ROW($1:$2289)),16))","v":{"$error":"#NUM!"}},0,null,{"$f":"INDEX(D:D,SMALL(IF(C$1:C$2289=K10,ROW($1:$2289)),16))","v":{"$error":"#NUM!"}},0,null,{"$f":"INDEX(D:D,SMALL(IF(C$1:C$2289=N10,ROW($1:$2289)),16))","v":{"$error":"#NUM!"}},0,null,{"$f":"INDEX(D:D,SMALL(IF(C$1:C$2289=Q10,ROW($1:$2289)),16))","v":{"$error":"#NUM!"}},0]
["Geistes_und_Sozialwissenschaften","Mitarbeiter","Geistes_und_SozialwissenschaftenMitarbeiter","Assistenz der Geschäftsleitung/ des Vorstands",null,null,null,{"$f":"INDEX(D:D,SMALL(IF(C$1:C$2289=$H$10,ROW($1:$2289)),17))","v":{"$error":"#NUM!"}},0,null,{"$f":"INDEX(D:D,SMALL(IF(C$1:C$2289=K10,ROW($1:$2289)),17))","v":{"$error":"#NUM!"}},0,null,{"$f":"INDEX(D:D,SMALL(IF(C$1:C$2289=N10,ROW($1:$2289)),17))","v":{"$error":"#NUM!"}},0,null,{"$f":"INDEX(D:D,SMALL(IF(C$1:C$2289=Q10,ROW($1:$2289)),17))","v":{"$error":"#NUM!"}},0]
["Geistes_und_Sozialwissenschaften","Mitarbeiter","Geistes_und_SozialwissenschaftenMitarbeiter","Aus- und Weiterbildung",null,null,null,{"$f":"INDEX(D:D,SMALL(IF(C$1:C$2289=$H$10,ROW($1:$2289)),18))","v":{"$error":"#NUM!"}},0,null,{"$f":"INDEX(D:D,SMALL(IF(C$1:C$2289=K10,ROW($1:$2289)),18))","v":{"$error":"#NUM!"}},0,null,{"$f":"INDEX(D:D,SMALL(IF(C$1:C$2289=N10,ROW($1:$2289)),18))","v":{"$error":"#NUM!"}},0,null,{"$f":"INDEX(D:D,SMALL(IF(C$1:C$2289=Q10,ROW($1:$2289)),18))","v":{"$error":"#NUM!"}},0]
["Geistes_und_Sozialwissenschaften","Mitarbeiter","Geistes_und_SozialwissenschaftenMitarbeiter","Business Development",null,null,null,{"$f":"INDEX(D:D,SMALL(IF(C$1:C$2289=$H$10,ROW($1:$2289)),19))","v":{"$error":"#NUM!"}},0,null,{"$f":"INDEX(D:D,SMALL(IF(C$1:C$2289=K10,ROW($1:$2289)),19))","v":{"$error":"#NUM!"}},0,null,{"$f":"INDEX(D:D,SMALL(IF(C$1:C$2289=N10,ROW($1:$2289)),19))","v":{"$error":"#NUM!"}},0,null,{"$f":"INDEX(D:D,SMALL(IF(C$1:C$2289=Q10,ROW($1:$2289)),19))","v":{"$error":"#NUM!"}},0]
["Geistes_und_Sozialwissenschaften","Mitarbeiter","Geistes_und_SozialwissenschaftenMitarbeiter","Consulting",null,null,null,{"$f":"INDEX(D:D,SMALL(IF(C$1:C$2289=$H$10,ROW($1:$2289)),20))","v":{"$error":"#NUM!"}},0,null,{"$f":"INDEX(D:D,SMALL(IF(C$1:C$2289=K10,ROW($1:$2289)),20))","v":{"$error":"#NUM!"}},0,null,{"$f":"INDEX(D:D,SMALL(IF(C$1:C$2289=N10,ROW($1:$2289)),20))","v":{"$error":"#NUM!"}},0,null,{"$f":"INDEX(D:D,SMALL(IF(C$1:C$2289=Q10,ROW($1:$2289)),20))","v":{"$error":"#NUM!"}},0]
["Geistes_und_Sozialwissenschaften","Mitarbeiter","Geistes_und_SozialwissenschaftenMitarbeiter","Content Management",null,null,null,{"$f":"INDEX(D:D,SMALL(IF(C$1:C$2289=$H$10,ROW($1:$2289)),21))","v":{"$error":"#NUM!"}},0,null,{"$f":"INDEX(D:D,SMALL(IF(C$1:C$2289=K10,ROW($1:$2289)),21))","v":{"$error":"#NUM!"}},0,null,{"$f":"INDEX(D:D,SMALL(IF(C$1:C$2289=N10,ROW($1:$2289)),21))","v":{"$error":"#NUM!"}},0,null,{"$f":"INDEX(D:D,SMALL(IF(C$1:C$2289=Q10,ROW($1:$2289)),21))","v":{"$error":"#NUM!"}},0]
["Geistes_und_Sozialwissenschaften","Mitarbeiter","Geistes_und_SozialwissenschaftenMitarbeiter","Controlling",null,null,null,{"$f":"INDEX(D:D,SMALL(IF(C$1:C$2289=$H$10,ROW($1:$2289)),22))","v":{"$error":"#NUM!"}},0,null,{"$f":"INDEX(D:D,SMALL(IF(C$1:C$2289=K10,ROW($1:$2289)),22))","v":{"$error":"#NUM!"}},0,null,{"$f":"INDEX(D:D,SMALL(IF(C$1:C$2289=N10,ROW($1:$2289)),22))","v":{"$error":"#NUM!"}},0,null,{"$f":"INDEX(D:D,SMALL(IF(C$1:C$2289=Q10,ROW($1:$2289)),22))","v":{"$error":"#NUM!"}},0]
["Geistes_und_Sozialwissenschaften","Mitarbeiter","Geistes_und_SozialwissenschaftenMitarbeiter","Design und Gestaltung",null,null,null,{"$f":"INDEX(D:D,SMALL(IF(C$1:C$2289=$H$10,ROW($1:$2289)),23))","v":{"$error":"#NUM!"}},0,null,{"$f":"INDEX(D:D,SMALL(IF(C$1:C$2289=K10,ROW($1:$2289)),23))","v":{"$error":"#NUM!"}},0,null,{"$f":"INDEX(D:D,SMALL(IF(C$1:C$2289=N10,ROW($1:$2289)),23))","v":{"$error":"#NUM!"}},0,null,{"$f":"INDEX(D:D,SMALL(IF(C$1:C$2289=Q10,ROW($1:$2289)),23))","v":{"$error":"#NUM!"}},0]
["Geistes_und_Sozialwissenschaften","Mitarbeiter","Geistes_und_SozialwissenschaftenMitarbeiter","Einkauf und Beschaffung",null,null,null,{"$f":"INDEX(D:D,SMALL(IF(C$1:C$2289=$H$10,ROW($1:$2289)),24))","v":{"$error":"#NUM!"}},0,null,{"$f":"INDEX(D:D,SMALL(IF(C$1:C$2289=K10,ROW($1:$2289)),24))","v":{"$error":"#NUM!"}},0,null,{"$f":"INDEX(D:D,SMALL(IF(C$1:C$2289=N10,ROW($1:$2289)),24))","v":{"$error":"#NUM!"}},0,null,{"$f":"INDEX(D:D,SMALL(IF(C$1:C$2289=Q10,ROW($1:$2289)),24))","v":{"$error":"#NUM!"}},0]
["Geistes_und_Sozialwissenschaften","Mitarbeiter","Geistes_und_SozialwissenschaftenMitarbeiter","Event Management",null,null,null,{"$f":"INDEX(D:D,SMALL(IF(C$1:C$2289=$H$10,ROW($1:$2289)),25))","v":{"$error":"#NUM!"}},0,null,{"$f":"INDEX(D:D,SMALL(IF(C$1:C$2289=K10,ROW($1:$2289)),25))","v":{"$error":"#NUM!"}},0,null,{"$f":"INDEX(D:D,SMALL(IF(C$1:C$2289=N10,ROW($1:$2289)),25))","v":{"$error":"#NUM!"}},0,null,{"$f":"INDEX(D:D,SMALL(IF(C$1:C$2289=Q10,ROW($1:$2289)),25))","v":{"$error":"#NUM!"}},0]
["Geistes_und_Sozialwissenschaften","Mitarbeiter","Geistes_und_SozialwissenschaftenMitarbeiter","Facility Management",null,null,null,{"$f":"INDEX(D:D,SMALL(IF(C$1:C$2289=$H$10,ROW($1:$2289)),26))","v":{"$error":"#NUM!"}},0,null,{"$f":"INDEX(D:D,SMALL(IF(C$1:C$2289=K10,ROW($1:$2289)),26))","v":{"$error":"#NUM!"}},0,null,{"$f":"INDEX(D:D,SMALL(IF(C$1:C$2289=N10,ROW($1:$2289)),26))","v":{"$error":"#NUM!"}},0,null,{"$f":"INDEX(D:D,SMALL(IF(C$1:C$2289=Q10,ROW($1:$2289)),26))","v":{"$error":"#NUM!"}},0]
["Geistes_und_Sozialwissenschaften","Mitarbeiter","Geistes_und_SozialwissenschaftenMitarbeiter","Finanzwesen",null,null,null,{"$f":"INDEX(D:D,SMALL(IF(C$1:C$2289=$H$10,ROW($1:$2289)),27))","v":{"$error":"#NUM!"}},0,null,{"$f":"INDEX(D:D,SMALL(IF(C$1:C$2289=K10,ROW($1:$2289)),27))","v":{"$error":"#NUM!"}},0,null,{"$f":"INDEX(D:D,SMALL(IF(C$1:C$2289=N10,ROW($1:$2289)),27))","v":{"$error":"#NUM!"}},0,null,{"$f":"INDEX(D:D,SMALL(IF(C$1:C$2289=Q10,ROW($1:$2289)),27))","v":{"$error":"#NUM!"}},0]
["Geistes_und_Sozialwissenschaften","Mitarbeiter","Geistes_und_SozialwissenschaftenMitarbeiter","Forschung und Entwicklung",null,null,null,{"$f":"INDEX(D:D,SMALL(IF(C$1:C$2289=$H$10,ROW($1:$2289)),28))","v":{"$error":"#NUM!"}},0,null,{"$f":"INDEX(D:D,SMALL(IF(C$1:C$2289=K10,ROW($1:$2289)),28))","v":{"$error":"#NUM!"}},0,null,{"$f":"INDEX(D:D,SMALL(IF(C$1:C$2289=N10,ROW($1:$2289)),28))","v":{"$error":"#NUM!"}},0,null,{"$f":"INDEX(D:D,SMALL(IF(C$1:C$2289=Q10,ROW($1:$2289)),28))","v":{"$error":"#NUM!"}},0]
["Geistes_und_Sozialwissenschaften","Mitarbeiter","Geistes_und_SozialwissenschaftenMitarbeiter","Gesundheitsmanagement",null,null,null,{"$f":"INDEX(D:D,SMALL(IF(C$1:C$2289=$H$10,ROW($1:$2289)),29))","v":{"$error":"#NUM!"}},0,null,{"$f":"INDEX(D:D,SMALL(IF(C$1:C$2289=K10,ROW($1:$2289)),29))","v":{"$error":"#NUM!"}},0,null,{"$f":"INDEX(D:D,SMALL(IF(C$1:C$2289=N10,ROW($1:$2289)),29))","v":{"$error":"#NUM!"}},0,null,{"$f":"INDEX(D:D,SMALL(IF(C$1:C$2289=Q10,ROW($1:$2289)),29))","v":{"$error":"#NUM!"}},0]
["Geistes_und_Sozialwissenschaften","Mitarbeiter","Geistes_und_SozialwissenschaftenMitarbeiter","Key Account Management",null,null,null,{"$f":"INDEX(D:D,SMALL(IF(C$1:C$2289=$H$10,ROW($1:$2289)),30))","v":{"$error":"#NUM!"}},0,null,{"$f":"INDEX(D:D,SMALL(IF(C$1:C$2289=K10,ROW($1:$2289)),30))","v":{"$error":"#NUM!"}},0,null,{"$f":"INDEX(D:D,SMALL(IF(C$1:C$2289=N10,ROW($1:$2289)),30))","v":{"$error":"#NUM!"}},0,null,{"$f":"INDEX(D:D,SMALL(IF(C$1:C$2289=Q10,ROW($1:$2289)),30))","v":{"$error":"#NUM!"}},0]
["Geistes_und_Sozialwissenschaften","Mitarbeiter","Geistes_und_SozialwissenschaftenMitarbeiter","Logistik",null,null,null,{"$f":"INDEX(D:D,SMALL(IF(C$1:C$2289=$H$10,ROW($1:$2289)),31))","v":{"$error":"#NUM!"}},0,null,{"$f":"INDEX(D:D,SMALL(IF(C$1:C$2289=K10,ROW($1:$2289)),31))","v":{"$error":"#NUM!"}},0,null,{"$f":"INDEX(D:D,SMALL(IF(C$1:C$2289=N10,ROW($1:$2289)),31))","v":{"$error":"#NUM!"}},0,null,{"$f":"INDEX(D:D,SMALL(IF(C$1:C$2289=Q10,ROW($1:$2289)),31))","v":{"$error":"#NUM!"}},0]
["Geistes_und_Sozialwissenschaften","Mitarbeiter","Geistes_und_SozialwissenschaftenMitarbeiter","Marketing",null,null,null,{"$f":"INDEX(D:D,SMALL(IF(C$1:C$2289=$H$10,ROW($1:$2289)),32))","v":{"$error":"#NUM!"}},0,null,{"$f":"INDEX(D:D,SMALL(IF(C$1:C$2289=K10,ROW($1:$2289)),32))","v":{"$error":"#NUM!"}},0,null,{"$f":"INDEX(D:D,SMALL(IF(C$1:C$2289=N10,ROW($1:$2289)),32))","v":{"$error":"#NUM!"}},0,null,{"$f":"INDEX(D:D,SMALL(IF(C$1:C$2289=Q10,ROW($1:$2289)),32))","v":{"$error":"#NUM!"}},0]
["Geistes_und_Sozialwissenschaften","Mitarbeiter","Geistes_und_SozialwissenschaftenMitarbeiter","Marktforschung",null,null,null,{"$f":"INDEX(D:D,SMALL(IF(C$1:C$2289=$H$10,ROW($1:$2289)),33))","v":{"$error":"#NUM!"}},0,null,{"$f":"INDEX(D:D,SMALL(IF(C$1:C$2289=K10,ROW($1:$2289)),33))","v":{"$error":"#NUM!"}},0,null,{"$f":"INDEX(D:D,SMALL(IF(C$1:C$2289=N10,ROW($1:$2289)),33))","v":{"$error":"#NUM!"}},0,null,{"$f":"INDEX(D:D,SMALL(IF(C$1:C$2289=Q10,ROW($1:$2289)),33))","v":{"$error":"#NUM!"}},0]
["Geistes_und_Sozialwissenschaften","Mitarbeiter","Geistes_und_SozialwissenschaftenMitarbeiter","Online-Marketing",null,null,null,{"$f":"INDEX(D:D,SMALL(IF(C$1:C$2289=$H$10,ROW($1:$2289)),34))","v":{"$error":"#NUM!"}},0,null,{"$f":"INDEX(D:D,SMALL(IF(C$1:C$2289=K10,ROW($1:$2289)),34))","v":{"$error":"#NUM!"}},0,null,{"$f":"INDEX(D:D,SMALL(IF(C$1:C$2289=N10,ROW($1:$2289)),34))","v":{"$error":"#NUM!"}},0,null,{"$f":"INDEX(D:D,SMALL(IF(C$1:C$2289=Q10,ROW($1:$2289)),34))","v":{"$error":"#NUM!"}},0]
["Geistes_und_Sozialwissenschaften","Mitarbeiter","Geistes_und_SozialwissenschaftenMitarbeiter","Personalwesen",null,null,null,{"$f":"INDEX(D:D,SMALL(IF(C$1:C$2289=$H$10,ROW($1:$2289)),35))","v":{"$error":"#NUM!"}},0,null,{"$f":"INDEX(D:D,SMALL(IF(C$1:C$2289=K10,ROW($1:$2289)),35))","v":{"$error":"#NUM!"}},0,null,{"$f":"INDEX(D:D,SMALL(IF(C$1:C$2289=N10,ROW($1:$2289)),35))","v":{"$error":"#NUM!"}},0,null,{"$f":"INDEX(D:D,SMALL(IF(C$1:C$2289=Q10,ROW($1:$2289)),35))","v":{"$error":"#NUM!"}},0]
["Geistes_und_Sozialwissenschaften","Mitarbeiter","Geistes_und_SozialwissenschaftenMitarbeiter","Planung",null,null,null,{"$f":"INDEX(D:D,SMALL(IF(C$1:C$2289=$H$10,ROW($1:$2289)),36))","v":{"$error":"#NUM!"}},0,null,{"$f":"INDEX(D:D,SMALL(IF(C$1:C$2289=K10,ROW($1:$2289)),36))","v":{"$error":"#NUM!"}},0,null,{"$f":"INDEX(D:D,SMALL(IF(C$1:C$2289=N10,ROW($1:$2289)),36))","v":{"$error":"#NUM!"}},0,null,{"$f":"INDEX(D:D,SMALL(IF(C$1:C$2289=Q10,ROW($1:$2289)),36))","v":{"$error":"#NUM!"}},0]
["Geistes_und_Sozialwissenschaften","Mitarbeiter","Geistes_und_SozialwissenschaftenMitarbeiter","Produktmanagement",null,null,null,{"$f":"INDEX(D:D,SMALL(IF(C$1:C$2289=$H$10,ROW($1:$2289)),37))","v":{"$error":"#NUM!"}},0,null,{"$f":"INDEX(D:D,SMALL(IF(C$1:C$2289=K10,ROW($1:$2289)),37))","v":{"$error":"#NUM!"}},0,null,{"$f":"INDEX(D:D,SMALL(IF(C$1:C$2289=N10,ROW($1:$2289)),37))","v":{"$error":"#NUM!"}},0,null,{"$f":"INDEX(D:D,SMALL(IF(C$1:C$2289=Q10,ROW($1:$2289)),37))","v":{"$error":"#NUM!"}},0]
["Geistes_und_Sozialwissenschaften","Mitarbeiter","Geistes_und_SozialwissenschaftenMitarbeiter","Projektmanagement",null,null,null,{"$f":"INDEX(D:D,SMALL(IF(C$1:C$2289=$H$10,ROW($1:$2289)),38))","v":{"$error":"#NUM!"}},0,null,{"$f":"INDEX(D:D,SMALL(IF(C$1:C$2289=K10,ROW($1:$2289)),38))","v":{"$error":"#NUM!"}},0,null,{"$f":"INDEX(D:D,SMALL(IF(C$1:C$2289=N10,ROW($1:$2289)),38))","v":{"$error":"#NUM!"}},0,null,{"$f":"INDEX(D:D,SMALL(IF(C$1:C$2289=Q10,ROW($1:$2289)),38))","v":{"$error":"#NUM!"}},0]
["Geistes_und_Sozialwissenschaften","Mitarbeiter","Geistes_und_SozialwissenschaftenMitarbeiter","Prozessmanagement",null,null,null,{"$f":"INDEX(D:D,SMALL(IF(C$1:C$2289=$H$10,ROW($1:$2289)),39))","v":{"$error":"#NUM!"}},0,null,{"$f":"INDEX(D:D,SMALL(IF(C$1:C$2289=K10,ROW($1:$2289)),39))","v":{"$error":"#NUM!"}},0,null,{"$f":"INDEX(D:D,SMALL(IF(C$1:C$2289=N10,ROW($1:$2289)),39))","v":{"$error":"#NUM!"}},0,null,{"$f":"INDEX(D:D,SMALL(IF(C$1:C$2289=Q10,ROW($1:$2289)),39))","v":{"$error":"#NUM!"}},0]
["Geistes_und_Sozialwissenschaften","Mitarbeiter","Geistes_und_SozialwissenschaftenMitarbeiter","Public Relation und Unternehmenskommunikation",null,null,null,{"$f":"INDEX(D:D,SMALL(IF(C$1:C$2289=$H$10,ROW($1:$2289)),40))","v":{"$error":"#NUM!"}},0,null,{"$f":"INDEX(D:D,SMALL(IF(C$1:C$2289=K10,ROW($1:$2289)),40))","v":{"$error":"#NUM!"}},0,null,{"$f":"INDEX(D:D,SMALL(IF(C$1:C$2289=N10,ROW($1:$2289)),40))","v":{"$error":"#NUM!"}},0,null,{"$f":"INDEX(D:D,SMALL(IF(C$1:C$2289=Q10,ROW($1:$2289)),40))","v":{"$error":"#NUM!"}},0]
["Geistes_und_Sozialwissenschaften","Mitarbeiter","Geistes_und_SozialwissenschaftenMitarbeiter","Qualitätswesen",null,null,null,{"$f":"INDEX(D:D,SMALL(IF(C$1:C$2289=$H$10,ROW($1:$2289)),41))","v":{"$error":"#NUM!"}},0,null,{"$f":"INDEX(D:D,SMALL(IF(C$1:C$2289=K10,ROW($1:$2289)),41))","v":{"$error":"#NUM!"}},0,null,{"$f":"INDEX(D:D,SMALL(IF(C$1:C$2289=N10,ROW($1:$2289)),41))","v":{"$error":"#NUM!"}},0,null,{"$f":"INDEX(D:D,SMALL(IF(C$1:C$2289=Q10,ROW($1:$2289)),41))","v":{"$error":"#NUM!"}},0]
["Geistes_und_Sozialwissenschaften","Mitarbeiter","Geistes_und_SozialwissenschaftenMitarbeiter","Redaktion",null,null,null,{"$f":"INDEX(D:D,SMALL(IF(C$1:C$2289=$H$10,ROW($1:$2289)),42))","v":{"$error":"#NUM!"}},0,null,{"$f":"INDEX(D:D,SMALL(IF(C$1:C$2289=K10,ROW($1:$2289)),42))","v":{"$error":"#NUM!"}},0,null,{"$f":"INDEX(D:D,SMALL(IF(C$1:C$2289=N10,ROW($1:$2289)),42))","v":{"$error":"#NUM!"}},0,null,{"$f":"INDEX(D:D,SMALL(IF(C$1:C$2289=Q10,ROW($1:$2289)),42))","v":{"$error":"#NUM!"}},0]
["Geistes_und_Sozialwissenschaften","Mitarbeiter","Geistes_und_SozialwissenschaftenMitarbeiter","Sozialwesen",null,null,null,{"$f":"INDEX(D:D,SMALL(IF(C$1:C$2289=$H$10,ROW($1:$2289)),43))","v":{"$error":"#NUM!"}},0,null,{"$f":"INDEX(D:D,SMALL(IF(C$1:C$2289=K10,ROW($1:$2289)),43))","v":{"$error":"#NUM!"}},0,null,{"$f":"INDEX(D:D,SMALL(IF(C$1:C$2289=N10,ROW($1:$2289)),43))","v":{"$error":"#NUM!"}},0,null,{"$f":"INDEX(D:D,SMALL(IF(C$1:C$2289=Q10,ROW($1:$2289)),43))","v":{"$error":"#NUM!"}},0]
["Geistes_und_Sozialwissenschaften","Mitarbeiter","Geistes_und_SozialwissenschaftenMitarbeiter","Strategieentwicklung",null,null,null,{"$f":"INDEX(D:D,SMALL(IF(C$1:C$2289=$H$10,ROW($1:$2289)),44))","v":{"$error":"#NUM!"}},0,null,{"$f":"INDEX(D:D,SMALL(IF(C$1:C$2289=K10,ROW($1:$2289)),44))","v":{"$error":"#NUM!"}},0,null,{"$f":"INDEX(D:D,SMALL(IF(C$1:C$2289=N10,ROW($1:$2289)),44))","v":{"$error":"#NUM!"}},0,null,{"$f":"INDEX(D:D,SMALL(IF(C$1:C$2289=Q10,ROW($1:$2289)),44))","v":{"$error":"#NUM!"}},0]
["Geistes_und_Sozialwissenschaften","Mitarbeiter","Geistes_und_SozialwissenschaftenMitarbeiter","Strategisches Produktmanagement",null,null,null,{"$f":"INDEX(D:D,SMALL(IF(C$1:C$2289=$H$10,ROW($1:$2289)),45))","v":{"$error":"#NUM!"}},0,null,{"$f":"INDEX(D:D,SMALL(IF(C$1:C$2289=K10,ROW($1:$2289)),45))","v":{"$error":"#NUM!"}},0,null,{"$f":"INDEX(D:D,SMALL(IF(C$1:C$2289=N10,ROW($1:$2289)),45))","v":{"$error":"#NUM!"}},0,null,{"$f":"INDEX(D:D,SMALL(IF(C$1:C$2289=Q10,ROW($1:$2289)),45))","v":{"$error":"#NUM!"}},0]
["Geistes_und_Sozialwissenschaften","Mitarbeiter","Geistes_und_SozialwissenschaftenMitarbeiter","Therapie",null,null,null,{"$f":"INDEX(D:D,SMALL(IF(C$1:C$2289=$H$10,ROW($1:$2289)),46))","v":{"$error":"#NUM!"}},0,null,{"$f":"INDEX(D:D,SMALL(IF(C$1:C$2289=K10,ROW($1:$2289)),46))","v":{"$error":"#NUM!"}},0,null,{"$f":"INDEX(D:D,SMALL(IF(C$1:C$2289=N10,ROW($1:$2289)),46))","v":{"$error":"#NUM!"}},0,null,{"$f":"INDEX(D:D,SMALL(IF(C$1:C$2289=Q10,ROW($1:$2289)),46))","v":{"$error":"#NUM!"}},0]
["Geistes_und_Sozialwissenschaften","Mitarbeiter","Geistes_und_SozialwissenschaftenMitarbeiter","Unternehmenskommunikation und Public Relation",null,null,null,{"$f":"INDEX(D:D,SMALL(IF(C$1:C$2289=$H$10,ROW($1:$2289)),47))","v":{"$error":"#NUM!"}},0,null,{"$f":"INDEX(D:D,SMALL(IF(C$1:C$2289=K10,ROW($1:$2289)),47))","v":{"$error":"#NUM!"}},0,null,{"$f":"INDEX(D:D,SMALL(IF(C$1:C$2289=N10,ROW($1:$2289)),47))","v":{"$error":"#NUM!"}},0,null,{"$f":"INDEX(D:D,SMALL(IF(C$1:C$2289=Q10,ROW($1:$2289)),47))","v":{"$error":"#NUM!"}},0]
["Geistes_und_Sozialwissenschaften","Mitarbeiter","Geistes_und_SozialwissenschaftenMitarbeiter","Vertrieb-Außendienst",null,null,null,{"$f":"INDEX(D:D,SMALL(IF(C$1:C$2289=$H$10,ROW($1:$2289)),48))","v":{"$error":"#NUM!"}},0,null,{"$f":"INDEX(D:D,SMALL(IF(C$1:C$2289=K10,ROW($1:$2289)),48))","v":{"$error":"#NUM!"}},0,null,{"$f":"INDEX(D:D,SMALL(IF(C$1:C$2289=N10,ROW($1:$2289)),48))","v":{"$error":"#NUM!"}},0,null,{"$f":"INDEX(D:D,SMALL(IF(C$1:C$2289=Q10,ROW($1:$2289)),48))","v":{"$error":"#NUM!"}},0]
["Geistes_und_Sozialwissenschaften","Mitarbeiter","Geistes_und_SozialwissenschaftenMitarbeiter","Vertrieb-Innendienst",null,null,null,{"$f":"INDEX(D:D,SMALL(IF(C$1:C$2289=$H$10,ROW($1:$2289)),49))","v":{"$error":"#NUM!"}},0,null,{"$f":"INDEX(D:D,SMALL(IF(C$1:C$2289=K10,ROW($1:$2289)),49))","v":{"$error":"#NUM!"}},0,null,{"$f":"INDEX(D:D,SMALL(IF(C$1:C$2289=N10,ROW($1:$2289)),49))","v":{"$error":"#NUM!"}},0,null,{"$f":"INDEX(D:D,SMALL(IF(C$1:C$2289=Q10,ROW($1:$2289)),49))","v":{"$error":"#NUM!"}},0]
["Geistes_und_Sozialwissenschaften","Mitarbeiter","Geistes_und_SozialwissenschaftenMitarbeiter","Vertriebssteuerung",null,null,null,{"$f":"INDEX(D:D,SMALL(IF(C$1:C$2289=$H$10,ROW($1:$2289)),50))","v":{"$error":"#NUM!"}},0,null,{"$f":"INDEX(D:D,SMALL(IF(C$1:C$2289=K10,ROW($1:$2289)),50))","v":{"$error":"#NUM!"}},0,null,{"$f":"INDEX(D:D,SMALL(IF(C$1:C$2289=N10,ROW($1:$2289)),50))","v":{"$error":"#NUM!"}},0,null,{"$f":"INDEX(D:D,SMALL(IF(C$1:C$2289=Q10,ROW($1:$2289)),50))","v":{"$error":"#NUM!"}},0]
["Geistes_und_Sozialwissenschaften","Personalreferent","Geistes_und_SozialwissenschaftenPersonalreferent","Personalwesen"]
["Geistes_und_Sozialwissenschaften","Produkt_Manager","Geistes_und_SozialwissenschaftenProdukt_Manager","Einkauf und Beschaffung"]
["Geistes_und_Sozialwissenschaften","Produkt_Manager","Geistes_und_SozialwissenschaftenProdukt_Manager","Produktmanagement"]
["Geistes_und_Sozialwissenschaften","Produkt_Manager","Geistes_und_SozialwissenschaftenProdukt_Manager","Strategisches Produktmanagement"]
["Geistes_und_Sozialwissenschaften","Projektleiter/_Projektmanager","Geistes_und_SozialwissenschaftenProjektleiter/_Projektmanager","Aus- und Weiterbildung"]
["Geistes_und_Sozialwissenschaften","Projektleiter/_Projektmanager","Geistes_und_SozialwissenschaftenProjektleiter/_Projektmanager","Controlling"]
["Geistes_und_Sozialwissenschaften","Projektleiter/_Projektmanager","Geistes_und_SozialwissenschaftenProjektleiter/_Projektmanager","Design und Gestaltung"]
["Geistes_und_Sozialwissenschaften","Projektleiter/_Projektmanager","Geistes_und_SozialwissenschaftenProjektleiter/_Projektmanager","Einkauf und Beschaffung"]
["Geistes_und_Sozialwissenschaften","Projektleiter/_Projektmanager",{"$f":"A69&B69&E69","v":"Geistes_und_SozialwissenschaftenProjektleiter/_Projektmanager"},"Facility Management"]
["Geistes_und_Sozialwissenschaften","Projektleiter/_Projektmanager","Geistes_und_SozialwissenschaftenProjektleiter/_Projektmanager","Finanzwesen"]
["Geistes_und_Sozialwissenschaften","Projektleiter/_Projektmanager","Geistes_und_SozialwissenschaftenProjektleiter/_Projektmanager","Forschung und Entwicklung"]
["Geistes_und_Sozialwissenschaften","Projektleiter/_Projektmanager","Geistes_und_SozialwissenschaftenProjektleiter/_Projektmanager","Gesundheitsmanagement"]
["Geistes_und_Sozialwissenschaften","Projektleiter/_Projektmanager","Geistes_und_SozialwissenschaftenProjektleiter/_Projektmanager","Logistik"]
["Geistes_und_Sozialwissenschaften","Projektleiter/_Projektmanager","Geistes_und_SozialwissenschaftenProjektleiter/_Projektmanager","Marketing"]
["Geistes_und_Sozialwissenschaften","Projektleiter/_Projektmanager","Geistes_und_SozialwissenschaftenProjektleiter/_Projektmanager","Marktforschung"]
["Geistes_und_Sozialwissenschaften","Projektleiter/_Projektmanager","Geistes_und_SozialwissenschaftenProjektleiter/_Projektmanager","Online-Marketing"]
["Geistes_und_Sozialwissenschaften","Projektleiter/_Projektmanager","Geistes_und_SozialwissenschaftenProjektleiter/_Projektmanager","Personalwesen"]
["Geistes_und_Sozialwissenschaften","Projektleiter/_Projektmanager","Geistes_und_SozialwissenschaftenProjektleiter/_Projektmanager","Planung"]
["Geistes_und_Sozialwissenschaften","Projektleiter/_Projektmanager","Geistes_und_SozialwissenschaftenProjektleiter/_Projektmanager","Projektmanagement"]
["Geistes_und_Sozialwissenschaften","Projektleiter/_Projektmanager","Geistes_und_SozialwissenschaftenProjektleiter/_Projektmanager","Public Relation und Unternehmenskommunikation"]
["Geistes_und_Sozialwissenschaften","Projektleiter/_Projektmanager","Geistes_und_SozialwissenschaftenProjektleiter/_Projektmanager","Qualitätswesen"]
["Geistes_und_Sozialwissenschaften","Projektleiter/_Projektmanager","Geistes_und_SozialwissenschaftenProjektleiter/_Projektmanager","Sozialwesen"]
["Geistes_und_Sozialwissenschaften","Projektleiter/_Projektmanager","Geistes_und_SozialwissenschaftenProjektleiter/_Projektmanager","Unternehmenskommunikation und Public Relation"]
["Geistes_und_Sozialwissenschaften","Projektleiter/_Projektmanager","Geistes_und_SozialwissenschaftenProjektleiter/_Projektmanager","Vertrieb-Innendienst"]
["Geistes_und_Sozialwissenschaften","Projektleiter/_Projektmanager","Geistes_und_SozialwissenschaftenProjektleiter/_Projektmanager","Vertriebssteuerung"]
["Geistes_und_Sozialwissenschaften","Projektmitarbeiter","Geistes_und_SozialwissenschaftenProjektmitarbeiter","Account Management"]
["Geistes_und_Sozialwissenschaften","Projektmitarbeiter","Geistes_und_SozialwissenschaftenProjektmitarbeiter","Allgemeine Verwaltung"]
["Geistes_und_Sozialwissenschaften","Projektmitarbeiter","Geistes_und_SozialwissenschaftenProjektmitarbeiter","Assistenz der Geschäftsleitung/ des Vorstands"]
["Geistes_und_Sozialwissenschaften","Projektmitarbeiter","Geistes_und_SozialwissenschaftenProjektmitarbeiter","Aus- und Weiterbildung"]
["Geistes_und_Sozialwissenschaften","Projektmitarbeiter","Geistes_und_SozialwissenschaftenProjektmitarbeiter","Business Development"]
["Geistes_und_Sozialwissenschaften","Projektmitarbeiter","Geistes_und_SozialwissenschaftenProjektmitarbeiter","Consulting"]
["Geistes_und_Sozialwissenschaften","Projektmitarbeiter","Geistes_und_SozialwissenschaftenProjektmitarbeiter","Content Management"]
["Geistes_und_Sozialwissenschaften","Projektmitarbeiter","Geistes_und_SozialwissenschaftenProjektmitarbeiter","Controlling"]
["Geistes_und_Sozialwissenschaften","Projektmitarbeiter","Geistes_und_SozialwissenschaftenProjektmitarbeiter","Design und Gestaltung"]
["Geistes_und_Sozialwissenschaften","Projektmitarbeiter","Geistes_und_SozialwissenschaftenProjektmitarbeiter","Einkauf und Beschaffung"]
["Geistes_und_Sozialwissenschaften","Projektmitarbeiter","Geistes_und_SozialwissenschaftenProjektmitarbeiter","Event Management"]
["Geistes_und_Sozialwissenschaften","Projektmitarbeiter","Geistes_und_SozialwissenschaftenProjektmitarbeiter","Facility Management"]
["Geistes_und_Sozialwissenschaften","Projektmitarbeiter","Geistes_und_SozialwissenschaftenProjektmitarbeiter","Finanzwesen"]
["Geistes_und_Sozialwissenschaften","Projektmitarbeiter","Geistes_und_SozialwissenschaftenProjektmitarbeiter","Forschung und Entwicklung"]
["Geistes_und_Sozialwissenschaften","Projektmitarbeiter","Geistes_und_SozialwissenschaftenProjektmitarbeiter","Gesundheitsmanagement"]
["Geistes_und_Sozialwissenschaften","Projektmitarbeiter","Geistes_und_SozialwissenschaftenProjektmitarbeiter","Key Account Management"]
["Geistes_und_Sozialwissenschaften","Projektmitarbeiter","Geistes_und_SozialwissenschaftenProjektmitarbeiter","Logistik"]
["Geistes_und_Sozialwissenschaften","Projektmitarbeiter","Geistes_und_SozialwissenschaftenProjektmitarbeiter","Marketing"]
["Geistes_und_Sozialwissenschaften","Projektmitarbeiter","Geistes_und_SozialwissenschaftenProjektmitarbeiter","Marktforschung"]
["Geistes_und_Sozialwissenschaften","Projektmitarbeiter","Geistes_und_SozialwissenschaftenProjektmitarbeiter","Online-Marketing"]
["Geistes_und_Sozialwissenschaften","Projektmitarbeiter","Geistes_und_SozialwissenschaftenProjektmitarbeiter","Personalwesen"]
["Geistes_und_Sozialwissenschaften","Projektmitarbeiter","Geistes_und_SozialwissenschaftenProjektmitarbeiter","Planung"]
["Geistes_und_Sozialwissenschaften","Projektmitarbeiter","Geistes_und_SozialwissenschaftenProjektmitarbeiter","Produktmanagement"]
["Geistes_und_Sozialwissenschaften","Projektmitarbeiter","Geistes_und_SozialwissenschaftenProjektmitarbeiter","Projektmanagement"]
["Geistes_und_Sozialwissenschaften","Projektmitarbeiter","Geistes_und_SozialwissenschaftenProjektmitarbeiter","Prozessmanagement"]
["Geistes_und_Sozialwissenschaften","Projektmitarbeiter","Geistes_und_SozialwissenschaftenProjektmitarbeiter","Public Relation und Unternehmenskommunikation"]
["Geistes_und_Sozialwissenschaften","Projektmitarbeiter","Geistes_und_SozialwissenschaftenProjektmitarbeiter","Qualitätswesen"]
["Geistes_und_Sozialwissenschaften","Projektmitarbeiter","Geistes_und_SozialwissenschaftenProjektmitarbeiter","Redaktion"]
["Geistes_und_Sozialwissenschaften","Projektmitarbeiter","Geistes_und_SozialwissenschaftenProjektmitarbeiter","Sozialwesen"]
["Geistes_und_Sozialwissenschaften","Projektmitarbeiter","Geistes_und_SozialwissenschaftenProjektmitarbeiter","Strategieentwicklung"]
["Geistes_und_Sozialwissenschaften","Projektmitarbeiter","Geistes_und_SozialwissenschaftenProjektmitarbeiter","Strategisches Produktmanagement"]
["Geistes_und_Sozialwissenschaften","Projektmitarbeiter","Geistes_und_SozialwissenschaftenProjektmitarbeiter","Therapie"]
["Geistes_und_Sozialwissenschaften","Projektmitarbeiter","Geistes_und_SozialwissenschaftenProjektmitarbeiter","Unternehmenskommunikation und Public Relation"]
["Geistes_und_Sozialwissenschaften","Projektmitarbeiter","Geistes_und_SozialwissenschaftenProjektmitarbeiter","Vertrieb-Außendienst"]
["Geistes_und_Sozialwissenschaften","Projektmitarbeiter","Geistes_und_SozialwissenschaftenProjektmitarbeiter","Vertrieb-Innendienst"]
["Geistes_und_Sozialwissenschaften","Projektmitarbeiter","Geistes_und_SozialwissenschaftenProjektmitarbeiter","Vertriebssteuerung"]
["Geistes_und_Sozialwissenschaften","Prozessmanager","Geistes_und_SozialwissenschaftenProzessmanager","Prozessmanagement"]
["Geistes_und_Sozialwissenschaften","Prüfungsassistent","Geistes_und_SozialwissenschaftenPrüfungsassistent","Content Management"]
["Geistes_und_Sozialwissenschaften","Prüfungsassistent","Geistes_und_SozialwissenschaftenPrüfungsassistent","Controlling"]
["Geistes_und_Sozialwissenschaften","Prüfungsassistent","Geistes_und_SozialwissenschaftenPrüfungsassistent","Einkauf und Beschaffung"]
["Geistes_und_Sozialwissenschaften","Prüfungsassistent","Geistes_und_SozialwissenschaftenPrüfungsassistent","Finanzwesen"]
["Geistes_und_Sozialwissenschaften","Prüfungsassistent","Geistes_und_SozialwissenschaftenPrüfungsassistent","Gesundheitsmanagement"]
["Geistes_und_Sozialwissenschaften","Prüfungsassistent","Geistes_und_SozialwissenschaftenPrüfungsassistent","Logistik"]
["Geistes_und_Sozialwissenschaften","Prüfungsassistent","Geistes_und_SozialwissenschaftenPrüfungsassistent","Prozessmanagement"]
["Geistes_und_Sozialwissenschaften","Prüfungsassistent","Geistes_und_SozialwissenschaftenPrüfungsassistent","Qualitätswesen"]
["Geistes_und_Sozialwissenschaften","Redakteur","Geistes_und_SozialwissenschaftenRedakteur","Redaktion"]
["Geistes_und_Sozialwissenschaften","Referent","Geistes_und_SozialwissenschaftenReferent","Aus- und Weiterbildung"]
["Geistes_und_Sozialwissenschaften","Referent",{"$f":"A133&B133&E133","v":"Geistes_und_SozialwissenschaftenReferent"},"Controlling"]
["Geistes_und_Sozialwissenschaften","Referent","Geistes_und_SozialwissenschaftenReferent","Event Management"]
["Geistes_und_Sozialwissenschaften","Referent","Geistes_und_SozialwissenschaftenReferent","Finanzwesen"]
["Geistes_und_Sozialwissenschaften","Referent","Geistes_und_SozialwissenschaftenReferent","Gesundheitsmanagement"]
["Geistes_und_Sozialwissenschaften","Referent","Geistes_und_SozialwissenschaftenReferent","Marketing"]
["Geistes_und_Sozialwissenschaften","Referent","Geistes_und_SozialwissenschaftenReferent","Personalwesen"]
["Geistes_und_Sozialwissenschaften","Referent","Geistes_und_SozialwissenschaftenReferent","Public Relation und Unternehmenskommunikation"]
["Geistes_und_Sozialwissenschaften","Referent","Geistes_und_SozialwissenschaftenReferent","Unternehmenskommunikation und Public Relation"]
["Geistes_und_Sozialwissenschaften","Sales_Manager","Geistes_und_SozialwissenschaftenSales_Manager","Vertrieb-Außendienst"]
["Geistes_und_Sozialwissenschaften","Strategie_Consultant","Geistes_und_SozialwissenschaftenStrategie_Consultant","Consulting"]
["Geistes_und_Sozialwissenschaften","Strategie_Consultant","Geistes_und_SozialwissenschaftenStrategie_Consultant","Strategieentwicklung"]
["Geistes_und_Sozialwissenschaften","Trainee","Geistes_und_SozialwissenschaftenTrainee","Account Management"]
["Geistes_und_Sozialwissenschaften","Trainee","Geistes_und_SozialwissenschaftenTrainee","Assistenz der Geschäftsleitung/ des Vorstands"]
["Geistes_und_Sozialwissenschaften","Trainee","Geistes_und_SozialwissenschaftenTrainee","Business Development"]
["Geistes_und_Sozialwissenschaften","Trainee","Geistes_und_SozialwissenschaftenTrainee","Consulting"]
["Geistes_und_Sozialwissenschaften","Trainee","Geistes_und_SozialwissenschaftenTrainee","Content Management"]
["Geistes_und_Sozialwissenschaften","Trainee","Geistes_und_SozialwissenschaftenTrainee","Controlling"]
["Geistes_und_Sozialwissenschaften","Trainee","Geistes_und_SozialwissenschaftenTrainee","Design und Gestaltung"]
["Geistes_und_Sozialwissenschaften","Trainee","Geistes_und_SozialwissenschaftenTrainee","Einkauf und Beschaffung"]
["Geistes_und_Sozialwissenschaften","Trainee","Geistes_und_SozialwissenschaftenTrainee","Event Management"]
["Geistes_und_Sozialwissenschaften","Trainee","Geistes_und_SozialwissenschaftenTrainee","Facility Management"]
["Geistes_und_Sozialwissenschaften","Trainee","Geistes_und_SozialwissenschaftenTrainee","Finanzwesen"]
["Geistes_und_Sozialwissenschaften","Trainee","Geistes_und_SozialwissenschaftenTrainee","Forschung und Entwicklung"]
["Geistes_und_Sozialwissenschaften","Trainee","Geistes_und_SozialwissenschaftenTrainee","Gesundheitsmanagement"]
["Geistes_und_Sozialwissenschaften","Trainee","Geistes_und_SozialwissenschaftenTrainee","Key Account Management"]
["Geistes_und_Sozialwissenschaften","Trainee","Geistes_und_SozialwissenschaftenTrainee","Logistik"]
["Geistes_und_Sozialwissenschaften","Trainee","Geistes_und_SozialwissenschaftenTrainee","Marketing"]
["Geistes_und_Sozialwissenschaften","Trainee","Geistes_und_SozialwissenschaftenTrainee","Marktforschung"]
["Geistes_und_Sozialwissenschaften","Trainee","Geistes_und_SozialwissenschaftenTrainee","Online-Marketing"]
["Geistes_und_Sozialwissenschaften","Trainee","Geistes_und_SozialwissenschaftenTrainee","Personalwesen"]
["Geistes_und_Sozialwissenschaften","Trainee","Geistes_und_SozialwissenschaftenTrainee","Produktmanagement"]
["Geistes_und_Sozialwissenschaften","Trainee","Geistes_und_SozialwissenschaftenTrainee","Projektmanagement"]
["Geistes_und_Sozialwissenschaften","Trainee","Geistes_und_SozialwissenschaftenTrainee","Prozessmanagement"]
["Geistes_und_Sozialwissenschaften","Trainee","Geistes_und_SozialwissenschaftenTrainee","Public Relation und Unternehmenskommunikation"]
["Geistes_und_Sozialwissenschaften","Trainee","Geistes_und_SozialwissenschaftenTrainee","Qualitätswesen"]
["Geistes_und_Sozialwissenschaften","Trainee","Geistes_und_SozialwissenschaftenTrainee","Redaktion"]
["Geistes_und_Sozialwissenschaften","Trainee","Geistes_und_SozialwissenschaftenTrainee","Sozialwesen"]
["Geistes_und_Sozialwissenschaften","Trainee","Geistes_und_SozialwissenschaftenTrainee","Strategieentwicklung"]
["Geistes_und_Sozialwissenschaften","Trainee","Geistes_und_SozialwissenschaftenTrainee","Strategisches Produktmanagement"]
["Geistes_und_Sozialwissenschaften","Trainee","Geistes_und_SozialwissenschaftenTrainee","Unternehmenskommunikation und Public Relation"]
["Geistes_und_Sozialwissenschaften","Trainee","Geistes_und_SozialwissenschaftenTrainee","Vertrieb-Außendienst"]
["Geistes_und_Sozialwissenschaften","Trainee","Geistes_und_SozialwissenschaftenTrainee","Vertrieb-Innendienst"]
["Geistes_und_Sozialwissenschaften","Trainee","Geistes_und_SozialwissenschaftenTrainee","Vertriebssteuerung"]
["Geistes_und_Sozialwissenschaften","Trainee_Filialleiter/_Verkaufsleiter","Geistes_und_SozialwissenschaftenTrainee_Filialleiter/_Verkaufsleiter","Vertrieb-Außendienst"]
["Geistes_und_Sozialwissenschaften","Vertriebler","Geistes_und_SozialwissenschaftenVertriebler","Vertrieb-Außendienst"]
["Geistes_und_Sozialwissenschaften","Vertriebler","Geistes_und_SozialwissenschaftenVertriebler","Key Account Management"]
["Geistes_und_Sozialwissenschaften","Vertriebler","Geistes_und_SozialwissenschaftenVertriebler","Account Management"]
["Geistes_und_Sozialwissenschaften","Wissenschaftlicher_Mitarbeiter","Geistes_und_SozialwissenschaftenWissenschaftlicher_Mitarbeiter","Forschung und Entwicklung"]
["Geistes_und_Sozialwissenschaften","Wissenschaftlicher_Mitarbeiter","Geistes_und_SozialwissenschaftenWissenschaftlicher_Mitarbeiter","Marktforschung"]
["Informatik","Account_Manager","InformatikAccount_Manager","Account Management"]
["Informatik","Assistent_der_Geschäftsleitung/_des_Vorstands","InformatikAssistent_der_Geschäftsleitung/_des_Vorstands","Assistenz der Geschäftsleitung/ des Vorstands"]
["Informatik","Associate","InformatikAssociate","Consulting"]
["Informatik","Associate","InformatikAssociate","Finanzwesen"]
["Informatik","Associate","InformatikAssociate","Strategieentwicklung"]
["Informatik","Business_Development_Manager","InformatikBusiness_Development_Manager","Business Development"]
["Informatik","Consultant","InformatikConsultant","Business Development"]
["Informatik","Consultant","InformatikConsultant","Consulting"]
["Informatik","Consultant","InformatikConsultant","Finanzwesen"]
["Informatik","Consultant","InformatikConsultant","IT-Consulting"]
["Informatik","Consultant","InformatikConsultant","Strategieentwicklung"]
["Informatik","Content_Manager","InformatikContent_Manager","Content Management"]
["Informatik","Controller","InformatikController","Controlling"]
["Informatik","Controller","InformatikController","Einkauf und Beschaffung"]
["Informatik","Controller","InformatikController","Finanzwesen"]
["Informatik","Controller",{"$f":"A197&B197&E197","v":"InformatikController"},"Produktion und Fertigung"]
["Informatik","Controller","InformatikController","Vertriebssteuerung"]
["Informatik","Einkäufer","InformatikEinkäufer","Einkauf und Beschaffung"]
["Informatik","Einkäufer","InformatikEinkäufer","Produktmanagement"]
["Informatik","Entwickler","InformatikEntwickler","Engineering"]
["Informatik","Entwickler","InformatikEntwickler","Entwicklung"]
["Informatik","Entwickler","InformatikEntwickler","Forschung und Entwicklung"]
["Informatik","Entwickler","InformatikEntwickler","Konstruktion"]
["Informatik","Entwickler","InformatikEntwickler","Mediengestaltung"]
["Informatik","Entwickler","InformatikEntwickler","Projektmanagement"]
["Informatik","Entwickler","InformatikEntwickler","Softwareentwicklung"]
["Informatik","Key_Account_Manager","InformatikKey_Account_Manager","Key Account Management"]
["Informatik","Konstrukteur","InformatikKonstrukteur","Engineering"]
["Informatik","Konstrukteur","InformatikKonstrukteur","Entwicklung"]
["Informatik","Konstrukteur","InformatikKonstrukteur","Forschung und Entwicklung"]
["Informatik","Konstrukteur","InformatikKonstrukteur","Konstruktion"]
["Informatik","Konstrukteur","InformatikKonstrukteur","Produktion und Fertigung"]
["Informatik","Konstrukteur","InformatikKonstrukteur","Projektmanagement"]
["Informatik","Mitarbeiter","InformatikMitarbeiter","Account Management"]
["Informatik","Mitarbeiter","InformatikMitarbeiter","Allgemeine Verwaltung"]
["Informatik","Mitarbeiter","InformatikMitarbeiter","Assistenz der Geschäftsleitung/ des Vorstands"]
["Informatik","Mitarbeiter","InformatikMitarbeiter","Aus- und Weiterbildung"]
["Informatik","Mitarbeiter","InformatikMitarbeiter","Business Development"]
["Informatik","Mitarbeiter","InformatikMitarbeiter","Consulting"]
["Informatik","Mitarbeiter","InformatikMitarbeiter","Content Management"]
["Informatik","Mitarbeiter","InformatikMitarbeiter","Controlling"]
["Informatik","Mitarbeiter","InformatikMitarbeiter","Design und Gestaltung"]
["Informatik","Mitarbeiter","InformatikMitarbeiter","Einkauf und Beschaffung"]
["Informatik","Mitarbeiter","InformatikMitarbeiter","Engineering"]
["Informatik","Mitarbeiter","InformatikMitarbeiter","Entwicklung"]
["Informatik","Mitarbeiter","InformatikMitarbeiter","Facility Management"]
["Informatik","Mitarbeiter","InformatikMitarbeiter","Finanzwesen"]
["Informatik","Mitarbeiter","InformatikMitarbeiter","Forschung und Entwicklung"]
["Informatik","Mitarbeiter","InformatikMitarbeiter","IT"]
["Informatik","Mitarbeiter","InformatikMitarbeiter","IT-Consulting"]
["Informatik","Mitarbeiter","InformatikMitarbeiter","Key Account Management"]
["Informatik","Mitarbeiter","InformatikMitarbeiter","Konstruktion"]
["Informatik","Mitarbeiter","InformatikMitarbeiter","Logistik"]
["Informatik","Mitarbeiter","InformatikMitarbeiter","Marketing"]
["Informatik","Mitarbeiter","InformatikMitarbeiter","Marktforschung"]
["Informatik","Mitarbeiter","InformatikMitarbeiter","Mediengestaltung"]
["Informatik","Mitarbeiter","InformatikMitarbeiter","Online-Marketing"]
["Informatik","Mitarbeiter","InformatikMitarbeiter","Planung"]
["Informatik","Mitarbeiter","InformatikMitarbeiter","Produktion und Fertigung"]
["Informatik","Mitarbeiter","InformatikMitarbeiter","Produktmanagement"]
["Informatik","Mitarbeiter","InformatikMitarbeiter","Projektmanagement"]
["Informatik","Mitarbeiter","InformatikMitarbeiter","Prozessmanagement"]
["Informatik","Mitarbeiter","InformatikMitarbeiter","Qualitätswesen"]
["Informatik","Mitarbeiter","InformatikMitarbeiter","Redaktion"]
["Informatik","Mitarbeiter","InformatikMitarbeiter","Softwareentwicklung"]
["Informatik","Mitarbeiter","InformatikMitarbeiter","Strategieentwicklung"]
["Informatik","Mitarbeiter","InformatikMitarbeiter","Strategisches Produktmanagement"]
["Informatik","Mitarbeiter","InformatikMitarbeiter","Vertrieb-Außendienst"]
["Informatik","Mitarbeiter","InformatikMitarbeiter","Vertrieb-Innendienst"]
["Informatik","Mitarbeiter","InformatikMitarbeiter","Vertriebssteuerung"]
["Informatik","Produkt_Manager","InformatikProdukt_Manager","Einkauf und Beschaffung"]
["Informatik","Produkt_Manager","InformatikProdukt_Manager","Produktmanagement"]
["Informatik","Produkt_Manager","InformatikProdukt_Manager","Strategisches Produktmanagement"]
["Informatik","Projektingenieur","InformatikProjektingenieur","Engineering"]
["Informatik","Projektingenieur","InformatikProjektingenieur","Entwicklung"]
["Informatik","Projektingenieur","InformatikProjektingenieur","Facility Management"]
["Informatik","Projektingenieur","InformatikProjektingenieur","Forschung und Entwicklung"]
["Informatik","Projektingenieur","InformatikProjektingenieur","IT"]
["Informatik","Projektingenieur","InformatikProjektingenieur","Konstruktion"]
["Informatik","Projektingenieur",{"$f":"A261&B261&E261","v":"InformatikProjektingenieur"},"Planung"]
["Informatik","Projektingenieur","InformatikProjektingenieur","Produktion und Fertigung"]
["Informatik","Projektingenieur","InformatikProjektingenieur","Projektmanagement"]
["Informatik","Projektingenieur","InformatikProjektingenieur","Prozessmanagement"]
["Informatik","Projektingenieur","InformatikProjektingenieur","Qualitätswesen"]
["Informatik","Projektingenieur","InformatikProjektingenieur","Softwareentwicklung"]
["Informatik","Projektleiter/_Projektmanager","InformatikProjektleiter/_Projektmanager","Aus- und Weiterbildung"]
["Informatik","Projektleiter/_Projektmanager","InformatikProjektleiter/_Projektmanager","Controlling"]
["Informatik","Projektleiter/_Projektmanager","InformatikProjektleiter/_Projektmanager","Design und Gestaltung"]
["Informatik","Projektleiter/_Projektmanager","InformatikProjektleiter/_Projektmanager","Einkauf und Beschaffung"]
["Informatik","Projektleiter/_Projektmanager","InformatikProjektleiter/_Projektmanager","Engineering"]
["Informatik","Projektleiter/_Projektmanager","InformatikProjektleiter/_Projektmanager","Entwicklung"]
["Informatik","Projektleiter/_Projektmanager","InformatikProjektleiter/_Projektmanager","Facility Management"]
["Informatik","Projektleiter/_Projektmanager","InformatikProjektleiter/_Projektmanager","Finanzwesen"]
["Informatik","Projektleiter/_Projektmanager","InformatikProjektleiter/_Projektmanager","Forschung und Entwicklung"]
["Informatik","Projektleiter/_Projektmanager","InformatikProjektleiter/_Projektmanager","IT"]
["Informatik","Projektleiter/_Projektmanager","InformatikProjektleiter/_Projektmanager","IT-Consulting"]
["Informatik","Projektleiter/_Projektmanager","InformatikProjektleiter/_Projektmanager","Konstruktion"]
["Informatik","Projektleiter/_Projektmanager","InformatikProjektleiter/_Projektmanager","Logistik"]
["Informatik","Projektleiter/_Projektmanager","InformatikProjektleiter/_Projektmanager","Marketing"]
["Informatik","Projektleiter/_Projektmanager","InformatikProjektleiter/_Projektmanager","Marktforschung"]
["Informatik","Projektleiter/_Projektmanager","InformatikProjektleiter/_Projektmanager","Mediengestaltung"]
["Informatik","Projektleiter/_Projektmanager","InformatikProjektleiter/_Projektmanager","Online-Marketing"]
["Informatik","Projektleiter/_Projektmanager","InformatikProjektleiter/_Projektmanager","Planung"]
["Informatik","Projektleiter/_Projektmanager","InformatikProjektleiter/_Projektmanager","Produktion und Fertigung"]
["Informatik","Projektleiter/_Projektmanager","InformatikProjektleiter/_Projektmanager","Projektmanagement"]
["Informatik","Projektleiter/_Projektmanager","InformatikProjektleiter/_Projektmanager","Qualitätswesen"]
["Informatik","Projektleiter/_Projektmanager","InformatikProjektleiter/_Projektmanager","Softwareentwicklung"]
["Informatik","Projektleiter/_Projektmanager","InformatikProjektleiter/_Projektmanager","Vertrieb-Innendienst"]
["Informatik","Projektleiter/_Projektmanager","InformatikProjektleiter/_Projektmanager","Vertriebssteuerung"]
["Informatik","Projektmitarbeiter","InformatikProjektmitarbeiter","Account Management"]
["Informatik","Projektmitarbeiter","InformatikProjektmitarbeiter","Allgemeine Verwaltung"]
["Informatik","Projektmitarbeiter","InformatikProjektmitarbeiter","Assistenz der Geschäftsleitung/ des Vorstands"]
["Informatik","Projektmitarbeiter","InformatikProjektmitarbeiter","Aus- und Weiterbildung"]
["Informatik","Projektmitarbeiter","InformatikProjektmitarbeiter","Business Development"]
["Informatik","Projektmitarbeiter","InformatikProjektmitarbeiter","Consulting"]
["Informatik","Projektmitarbeiter","InformatikProjektmitarbeiter","Content Management"]
["Informatik","Projektmitarbeiter","InformatikProjektmitarbeiter","Controlling"]
["Informatik","Projektmitarbeiter","InformatikProjektmitarbeiter","Design und Gestaltung"]
["Informatik","Projektmitarbeiter","InformatikProjektmitarbeiter","Einkauf und Beschaffung"]
["Informatik","Projektmitarbeiter","InformatikProjektmitarbeiter","Engineering"]
["Informatik","Projektmitarbeiter","InformatikProjektmitarbeiter","Entwicklung"]
["Informatik","Projektmitarbeiter","InformatikProjektmitarbeiter","Facility Management"]
["Informatik","Projektmitarbeiter","InformatikProjektmitarbeiter","Finanzwesen"]
["Informatik","Projektmitarbeiter","InformatikProjektmitarbeiter","Forschung und Entwicklung"]
["Informatik","Projektmitarbeiter","InformatikProjektmitarbeiter","IT"]
["Informatik","Projektmitarbeiter","InformatikProjektmitarbeiter","IT-Consulting"]
["Informatik","Projektmitarbeiter","InformatikProjektmitarbeiter","Key Account Management"]
["Informatik","Projektmitarbeiter","InformatikProjektmitarbeiter","Konstruktion"]
["Informatik","Projektmitarbeiter","InformatikProjektmitarbeiter","Logistik"]
["Informatik","Projektmitarbeiter","InformatikProjektmitarbeiter","Marketing"]
["Informatik","Projektmitarbeiter","InformatikProjektmitarbeiter","Marktforschung"]
["Informatik","Projektmitarbeiter","InformatikProjektmitarbeiter","Mediengestaltung"]
["Informatik","Projektmitarbeiter","InformatikProjektmitarbeiter","Online-Marketing"]
["Informatik","Projektmitarbeiter","InformatikProjektmitarbeiter","Planung"]
["Informatik","Projektmitarbeiter","InformatikProjektmitarbeiter","Produktion und Fertigung"]
["Informatik","Projektmitarbeiter","InformatikProjektmitarbeiter","Produktmanagement"]
["Informatik","Projektmitarbeiter","InformatikProjektmitarbeiter","Projektmanagement"]
["Informatik","Projektmitarbeiter","InformatikProjektmitarbeiter","Prozessmanagement"]
["Informatik","Projektmitarbeiter","InformatikProjektmitarbeiter","Qualitätswesen"]
["Informatik","Projektmitarbeiter","InformatikProjektmitarbeiter","Redaktion"]
["Informatik","Projektmitarbeiter","InformatikProjektmitarbeiter","Softwareentwicklung"]
["Informatik","Projektmitarbeiter","InformatikProjektmitarbeiter","Strategieentwicklung"]
["Informatik","Projektmitarbeiter","InformatikProjektmitarbeiter","Strategisches Produktmanagement"]
["Informatik","Projektmitarbeiter",{"$f":"A325&B325&E325","v":"InformatikProjektmitarbeiter"},"Vertrieb-Außendienst"]
["Informatik","Projektmitarbeiter","InformatikProjektmitarbeiter","Vertrieb-Innendienst"]
["Informatik","Projektmitarbeiter","InformatikProjektmitarbeiter","Vertriebssteuerung"]
["Informatik","Prozessmanager","InformatikProzessmanager","Prozessmanagement"]
["Informatik","Prüfungsassistent","InformatikPrüfungsassistent","Content Management"]
["Informatik","Prüfungsassistent","InformatikPrüfungsassistent","Controlling"]
["Informatik","Prüfungsassistent","InformatikPrüfungsassistent","Einkauf und Beschaffung"]
["Informatik","Prüfungsassistent","InformatikPrüfungsassistent","Engineering"]
["Informatik","Prüfungsassistent","InformatikPrüfungsassistent","Entwicklung"]
["Informatik","Prüfungsassistent","InformatikPrüfungsassistent","Finanzwesen"]
["Informatik","Prüfungsassistent","InformatikPrüfungsassistent","Konstruktion"]
["Informatik","Prüfungsassistent","InformatikPrüfungsassistent","Logistik"]
["Informatik","Prüfungsassistent","InformatikPrüfungsassistent","Produktion und Fertigung"]
["Informatik","Prüfungsassistent","InformatikPrüfungsassistent","Prozessmanagement"]
["Informatik","Prüfungsassistent","InformatikPrüfungsassistent","Qualitätswesen"]
["Informatik","Redakteur","InformatikRedakteur","Redaktion"]
["Informatik","Referent","InformatikReferent","Aus- und Weiterbildung"]
["Informatik","Referent","InformatikReferent","Controlling"]
["Informatik","Referent","InformatikReferent","Finanzwesen"]
["Informatik","Referent","InformatikReferent","Marketing"]
["Informatik","Sales_Manager","InformatikSales_Manager","Vertrieb-Außendienst"]
["Informatik","Softwareentwickler","InformatikSoftwareentwickler","IT"]
["Informatik","Softwareentwickler","InformatikSoftwareentwickler","IT-Consulting"]
["Informatik","Softwareentwickler","InformatikSoftwareentwickler","Projektmanagement"]
["Informatik","Softwareentwickler","InformatikSoftwareentwickler","Softwareentwicklung"]
["Informatik","Strategie_Consultant","InformatikStrategie_Consultant","Consulting"]
["Informatik","Strategie_Consultant","InformatikStrategie_Consultant","Strategieentwicklung"]
["Informatik","Technischer_Angestellter","InformatikTechnischer_Angestellter","Engineering"]
["Informatik","Technischer_Angestellter","InformatikTechnischer_Angestellter","Entwicklung"]
["Informatik","Technischer_Angestellter","InformatikTechnischer_Angestellter","Facility Management"]
["Informatik","Technischer_Angestellter","InformatikTechnischer_Angestellter","Forschung und Entwicklung"]
["Informatik","Technischer_Angestellter","InformatikTechnischer_Angestellter","IT"]
["Informatik","Technischer_Angestellter","InformatikTechnischer_Angestellter","Konstruktion"]
["Informatik","Technischer_Angestellter","InformatikTechnischer_Angestellter","Mediengestaltung"]
["Informatik","Technischer_Angestellter","InformatikTechnischer_Angestellter","Planung"]
["Informatik","Technischer_Angestellter","InformatikTechnischer_Angestellter","Produktion und Fertigung"]
["Informatik","Technischer_Angestellter","InformatikTechnischer_Angestellter","Projektmanagement"]
["Informatik","Technischer_Angestellter","InformatikTechnischer_Angestellter","Prozessmanagement"]
["Informatik","Trainee","InformatikTrainee","Account Management"]
["Informatik","Trainee","InformatikTrainee","Assistenz der Geschäftsleitung/ des Vorstands"]
["Informatik","Trainee","InformatikTrainee","Business Development"]
["Informatik","Trainee","InformatikTrainee","Consulting"]
["Informatik","Trainee","InformatikTrainee","Content Management"]
["Informatik","Trainee","InformatikTrainee","Controlling"]
["Informatik","Trainee","InformatikTrainee","Design und Gestaltung"]
["Informatik","Trainee","InformatikTrainee","Einkauf und Beschaffung"]
["Informatik","Trainee","InformatikTrainee","Engineering"]
["Informatik","Trainee","InformatikTrainee","Entwicklung"]
["Informatik","Trainee","InformatikTrainee","Facility Management"]
["Informatik","Trainee","InformatikTrainee","Finanzwesen"]
["Informatik","Trainee","InformatikTrainee","Forschung und Entwicklung"]
["Informatik","Trainee","InformatikTrainee","IT"]
["Informatik","Trainee","InformatikTrainee","IT-Consulting"]
["Informatik","Trainee","InformatikTrainee","Key Account Management"]
["Informatik","Trainee","InformatikTrainee","Konstruktion"]
["Informatik","Trainee","InformatikTrainee","Logistik"]
["Informatik","Trainee","InformatikTrainee","Marketing"]
["Informatik","Trainee","InformatikTrainee","Marktforschung"]
["Informatik","Trainee","InformatikTrainee","Online-Marketing"]
["Informatik","Trainee","InformatikTrainee","Produktion und Fertigung"]
["Informatik","Trainee","InformatikTrainee","Produktmanagement"]
["Informatik","Trainee","InformatikTrainee","Projektmanagement"]
["Informatik","Trainee","InformatikTrainee","Prozessmanagement"]
["Informatik","Trainee","InformatikTrainee","Qualitätswesen"]
["Informatik","Trainee",{"$f":"A389&B389&E389","v":"InformatikTrainee"},"Redaktion"]
["Informatik","Trainee","InformatikTrainee","Softwareentwicklung"]
["Informatik","Trainee","InformatikTrainee","Strategieentwicklung"]
["Informatik","Trainee","InformatikTrainee","Strategisches Produktmanagement"]
["Informatik","Trainee","InformatikTrainee","Vertrieb-Außendienst"]
["Informatik","Trainee","InformatikTrainee","Vertrieb-Innendienst"]
["Informatik","Trainee","InformatikTrainee","Vertriebssteuerung"]
["Informatik","Trainee_Filialleiter/_Verkaufsleiter","InformatikTrainee_Filialleiter/_Verkaufsleiter","Vertrieb-Außendienst"]
["Informatik","Vertriebler","InformatikVertriebler","Vertrieb-Außendienst"]
["Informatik","Vertriebler","InformatikVertriebler","Key Account Management"]
["Informatik","Vertriebler","InformatikVertriebler","Account Management"]
["Informatik","Wissenschaftlicher_Mitarbeiter","InformatikWissenschaftlicher_Mitarbeiter","Forschung und Entwicklung"]
["Informatik","Wissenschaftlicher_Mitarbeiter","InformatikWissenschaftlicher_Mitarbeiter","Marktforschung"]
["Ingenieurwissenschaften","Account_Manager","IngenieurwissenschaftenAccount_Manager","Account Management"]
["Ingenieurwissenschaften","Assistent_der_Geschäftsleitung/_des_Vorstands","IngenieurwissenschaftenAssistent_der_Geschäftsleitung/_des_Vorstands","Assistenz der Geschäftsleitung/ des Vorstands"]
["Ingenieurwissenschaften","Associate","IngenieurwissenschaftenAssociate","Consulting"]
["Ingenieurwissenschaften","Associate","IngenieurwissenschaftenAssociate","Finanzwesen"]
["Ingenieurwissenschaften","Associate","IngenieurwissenschaftenAssociate","Strategieentwicklung"]
["Ingenieurwissenschaften","Bauleiter","IngenieurwissenschaftenBauleiter","Bauleitung"]
["Ingenieurwissenschaften","Business_Development_Manager","IngenieurwissenschaftenBusiness_Development_Manager","Business Development"]
["Ingenieurwissenschaften","Consultant","IngenieurwissenschaftenConsultant","Business Development"]
["Ingenieurwissenschaften","Consultant","IngenieurwissenschaftenConsultant","Consulting"]
["Ingenieurwissenschaften","Consultant","IngenieurwissenschaftenConsultant","Finanzwesen"]
["Ingenieurwissenschaften","Consultant","IngenieurwissenschaftenConsultant","IT-Consulting"]
["Ingenieurwissenschaften","Consultant","IngenieurwissenschaftenConsultant","Strategieentwicklung"]
["Ingenieurwissenschaften","Content_Manager","IngenieurwissenschaftenContent_Manager","Content Management"]
["Ingenieurwissenschaften","Controller","IngenieurwissenschaftenController","Controlling"]
["Ingenieurwissenschaften","Controller","IngenieurwissenschaftenController","Einkauf und Beschaffung"]
["Ingenieurwissenschaften","Controller","IngenieurwissenschaftenController","Finanzwesen"]
["Ingenieurwissenschaften","Controller","IngenieurwissenschaftenController","Produktion und Fertigung"]
["Ingenieurwissenschaften","Controller","IngenieurwissenschaftenController","Vertriebssteuerung"]
["Ingenieurwissenschaften","Einkäufer","IngenieurwissenschaftenEinkäufer","Einkauf und Beschaffung"]
["Ingenieurwissenschaften","Einkäufer","IngenieurwissenschaftenEinkäufer","Produktmanagement"]
["Ingenieurwissenschaften","Entwickler","IngenieurwissenschaftenEntwickler","Engineering"]
["Ingenieurwissenschaften","Entwickler","IngenieurwissenschaftenEntwickler","Entwicklung"]
["Ingenieurwissenschaften","Entwickler","IngenieurwissenschaftenEntwickler","Forschung und Entwicklung"]
["Ingenieurwissenschaften","Entwickler","IngenieurwissenschaftenEntwickler","Konstruktion"]
["Ingenieurwissenschaften","Entwickler","IngenieurwissenschaftenEntwickler","Mediengestaltung"]
["Ingenieurwissenschaften","Entwickler","IngenieurwissenschaftenEntwickler","Projektmanagement"]
["Ingenieurwissenschaften","Entwickler","IngenieurwissenschaftenEntwickler","Softwareentwicklung"]
["Ingenieurwissenschaften","Key_Account_Manager","IngenieurwissenschaftenKey_Account_Manager","Key Account Management"]
["Ingenieurwissenschaften","Konstrukteur","IngenieurwissenschaftenKonstrukteur","Engineering"]
["Ingenieurwissenschaften","Konstrukteur","IngenieurwissenschaftenKonstrukteur","Entwicklung"]
["Ingenieurwissenschaften","Konstrukteur","IngenieurwissenschaftenKonstrukteur","Forschung und Entwicklung"]
["Ingenieurwissenschaften","Konstrukteur","IngenieurwissenschaftenKonstrukteur","Konstruktion"]
["Ingenieurwissenschaften","Konstrukteur","IngenieurwissenschaftenKonstrukteur","Produktion und Fertigung"]
["Ingenieurwissenschaften","Konstrukteur","IngenieurwissenschaftenKonstrukteur","Projektmanagement"]
["Ingenieurwissenschaften","Mitarbeiter","IngenieurwissenschaftenMitarbeiter","Account Management"]
["Ingenieurwissenschaften","Mitarbeiter","IngenieurwissenschaftenMitarbeiter","Allgemeine Verwaltung"]
["Ingenieurwissenschaften","Mitarbeiter","IngenieurwissenschaftenMitarbeiter","Assistenz der Geschäftsleitung/ des Vorstands"]
["Ingenieurwissenschaften","Mitarbeiter","IngenieurwissenschaftenMitarbeiter","Aus- und Weiterbildung"]
["Ingenieurwissenschaften","Mitarbeiter","IngenieurwissenschaftenMitarbeiter","Bauleitung"]
["Ingenieurwissenschaften","Mitarbeiter","IngenieurwissenschaftenMitarbeiter","Business Development"]
["Ingenieurwissenschaften","Mitarbeiter","IngenieurwissenschaftenMitarbeiter","Consulting"]
["Ingenieurwissenschaften","Mitarbeiter","IngenieurwissenschaftenMitarbeiter","Content Management"]
["Ingenieurwissenschaften","Mitarbeiter","IngenieurwissenschaftenMitarbeiter","Controlling"]
["Ingenieurwissenschaften","Mitarbeiter","IngenieurwissenschaftenMitarbeiter","Design und Gestaltung"]
["Ingenieurwissenschaften","Mitarbeiter","IngenieurwissenschaftenMitarbeiter","Einkauf und Beschaffung"]
["Ingenieurwissenschaften","Mitarbeiter","IngenieurwissenschaftenMitarbeiter","Engineering"]
["Ingenieurwissenschaften","Mitarbeiter","IngenieurwissenschaftenMitarbeiter","Entwicklung"]
["Ingenieurwissenschaften","Mitarbeiter","IngenieurwissenschaftenMitarbeiter","Facility Management"]
["Ingenieurwissenschaften","Mitarbeiter","IngenieurwissenschaftenMitarbeiter","Finanzwesen"]
["Ingenieurwissenschaften","Mitarbeiter","IngenieurwissenschaftenMitarbeiter","Forschung und Entwicklung"]
["Ingenieurwissenschaften","Mitarbeiter","IngenieurwissenschaftenMitarbeiter","IT"]
["Ingenieurwissenschaften","Mitarbeiter",{"$f":"A453&B453&E453","v":"IngenieurwissenschaftenMitarbeiter"},"IT-Consulting"]
["Ingenieurwissenschaften","Mitarbeiter","IngenieurwissenschaftenMitarbeiter","Key Account Management"]
["Ingenieurwissenschaften","Mitarbeiter","IngenieurwissenschaftenMitarbeiter","Konstruktion"]
["Ingenieurwissenschaften","Mitarbeiter","IngenieurwissenschaftenMitarbeiter","Logistik"]
["Ingenieurwissenschaften","Mitarbeiter","IngenieurwissenschaftenMitarbeiter","Marketing"]
["Ingenieurwissenschaften","Mitarbeiter","IngenieurwissenschaftenMitarbeiter","Marktforschung"]
["Ingenieurwissenschaften","Mitarbeiter","IngenieurwissenschaftenMitarbeiter","Mediengestaltung"]
["Ingenieurwissenschaften","Mitarbeiter","IngenieurwissenschaftenMitarbeiter","Online-Marketing"]
["Ingenieurwissenschaften","Mitarbeiter","IngenieurwissenschaftenMitarbeiter","Planung"]
["Ingenieurwissenschaften","Mitarbeiter","IngenieurwissenschaftenMitarbeiter","Produktion und Fertigung"]
["Ingenieurwissenschaften","Mitarbeiter","IngenieurwissenschaftenMitarbeiter","Produktmanagement"]
["Ingenieurwissenschaften","Mitarbeiter","IngenieurwissenschaftenMitarbeiter","Projektmanagement"]
["Ingenieurwissenschaften","Mitarbeiter","IngenieurwissenschaftenMitarbeiter","Prozessmanagement"]
["Ingenieurwissenschaften","Mitarbeiter","IngenieurwissenschaftenMitarbeiter","Qualitätswesen"]
["Ingenieurwissenschaften","Mitarbeiter","IngenieurwissenschaftenMitarbeiter","Redaktion"]
["Ingenieurwissenschaften","Mitarbeiter","IngenieurwissenschaftenMitarbeiter","Softwareentwicklung"]
["Ingenieurwissenschaften","Mitarbeiter","IngenieurwissenschaftenMitarbeiter","Strategieentwicklung"]
["Ingenieurwissenschaften","Mitarbeiter","IngenieurwissenschaftenMitarbeiter","Strategisches Produktmanagement"]
["Ingenieurwissenschaften","Mitarbeiter","IngenieurwissenschaftenMitarbeiter","Vertrieb-Außendienst"]
["Ingenieurwissenschaften","Mitarbeiter","IngenieurwissenschaftenMitarbeiter","Vertrieb-Innendienst"]
["Ingenieurwissenschaften","Mitarbeiter","IngenieurwissenschaftenMitarbeiter","Vertriebssteuerung"]
["Ingenieurwissenschaften","Produkt_Manager","IngenieurwissenschaftenProdukt_Manager","Einkauf und Beschaffung"]
["Ingenieurwissenschaften","Produkt_Manager","IngenieurwissenschaftenProdukt_Manager","Produktmanagement"]
["Ingenieurwissenschaften","Produkt_Manager","IngenieurwissenschaftenProdukt_Manager","Strategisches Produktmanagement"]
["Ingenieurwissenschaften","Projektingenieur","IngenieurwissenschaftenProjektingenieur","Bauleitung"]
["Ingenieurwissenschaften","Projektingenieur","IngenieurwissenschaftenProjektingenieur","Engineering"]
["Ingenieurwissenschaften","Projektingenieur","IngenieurwissenschaftenProjektingenieur","Entwicklung"]
["Ingenieurwissenschaften","Projektingenieur","IngenieurwissenschaftenProjektingenieur","Facility Management"]
["Ingenieurwissenschaften","Projektingenieur","IngenieurwissenschaftenProjektingenieur","Forschung und Entwicklung"]
["Ingenieurwissenschaften","Projektingenieur","IngenieurwissenschaftenProjektingenieur","IT"]
["Ingenieurwissenschaften","Projektingenieur","IngenieurwissenschaftenProjektingenieur","Konstruktion"]
["Ingenieurwissenschaften","Projektingenieur","IngenieurwissenschaftenProjektingenieur","Planung"]
["Ingenieurwissenschaften","Projektingenieur","IngenieurwissenschaftenProjektingenieur","Produktion und Fertigung"]
["Ingenieurwissenschaften","Projektingenieur","IngenieurwissenschaftenProjektingenieur","Projektmanagement"]
["Ingenieurwissenschaften","Projektingenieur","IngenieurwissenschaftenProjektingenieur","Prozessmanagement"]
["Ingenieurwissenschaften","Projektingenieur","IngenieurwissenschaftenProjektingenieur","Qualitätswesen"]
["Ingenieurwissenschaften","Projektingenieur","IngenieurwissenschaftenProjektingenieur","Softwareentwicklung"]
["Ingenieurwissenschaften","Projektleiter/_Projektmanager","IngenieurwissenschaftenProjektleiter/_Projektmanager","Aus- und Weiterbildung"]
["Ingenieurwissenschaften","Projektleiter/_Projektmanager","IngenieurwissenschaftenProjektleiter/_Projektmanager","Controlling"]
["Ingenieurwissenschaften","Projektleiter/_Projektmanager","IngenieurwissenschaftenProjektleiter/_Projektmanager","Design und Gestaltung"]
["Ingenieurwissenschaften","Projektleiter/_Projektmanager","IngenieurwissenschaftenProjektleiter/_Projektmanager","Einkauf und Beschaffung"]
["Ingenieurwissenschaften","Projektleiter/_Projektmanager","IngenieurwissenschaftenProjektleiter/_Projektmanager","Engineering"]
["Ingenieurwissenschaften","Projektleiter/_Projektmanager","IngenieurwissenschaftenProjektleiter/_Projektmanager","Entwicklung"]
["Ingenieurwissenschaften","Projektleiter/_Projektmanager","IngenieurwissenschaftenProjektleiter/_Projektmanager","Facility Management"]
["Ingenieurwissenschaften","Projektleiter/_Projektmanager","IngenieurwissenschaftenProjektleiter/_Projektmanager","Finanzwesen"]
["Ingenieurwissenschaften","Projektleiter/_Projektmanager","IngenieurwissenschaftenProjektleiter/_Projektmanager","Forschung und Entwicklung"]
["Ingenieurwissenschaften","Projektleiter/_Projektmanager","IngenieurwissenschaftenProjektleiter/_Projektmanager","IT"]
["Ingenieurwissenschaften","Projektleiter/_Projektmanager","IngenieurwissenschaftenProjektleiter/_Projektmanager","IT-Consulting"]
["Ingenieurwissenschaften","Projektleiter/_Projektmanager","IngenieurwissenschaftenProjektleiter/_Projektmanager","Konstruktion"]
["Ingenieurwissenschaften","Projektleiter/_Projektmanager","IngenieurwissenschaftenProjektleiter/_Projektmanager","Logistik"]
["Ingenieurwissenschaften","Projektleiter/_Projektmanager","IngenieurwissenschaftenProjektleiter/_Projektmanager","Marketing"]
["Ingenieurwissenschaften","Projektleiter/_Projektmanager","IngenieurwissenschaftenProjektleiter/_Projektmanager","Marktforschung"]
["Ingenieurwissenschaften","Projektleiter/_Projektmanager","IngenieurwissenschaftenProjektleiter/_Projektmanager","Mediengestaltung"]
["Ingenieurwissenschaften","Projektleiter/_Projektmanager","IngenieurwissenschaftenProjektleiter/_Projektmanager","Online-Marketing"]
["Ingenieurwissenschaften","Projektleiter/_Projektmanager","IngenieurwissenschaftenProjektleiter/_Projektmanager","Planung"]
["Ingenieurwissenschaften","Projektleiter/_Projektmanager","IngenieurwissenschaftenProjektleiter/_Projektmanager","Produktion und Fertigung"]
["Ingenieurwissenschaften","Projektleiter/_Projektmanager","IngenieurwissenschaftenProjektleiter/_Projektmanager","Projektmanagement"]
["Ingenieurwissenschaften","Projektleiter/_Projektmanager","IngenieurwissenschaftenProjektleiter/_Projektmanager","Qualitätswesen"]
["Ingenieurwissenschaften","Projektleiter/_Projektmanager","IngenieurwissenschaftenProjektleiter/_Projektmanager","Softwareentwicklung"]
["Ingenieurwissenschaften","Projektleiter/_Projektmanager","IngenieurwissenschaftenProjektleiter/_Projektmanager","Vertrieb-Innendienst"]
["Ingenieurwissenschaften","Projektleiter/_Projektmanager","IngenieurwissenschaftenProjektleiter/_Projektmanager","Vertriebssteuerung"]
["Ingenieurwissenschaften","Projektmitarbeiter","IngenieurwissenschaftenProjektmitarbeiter","Account Management"]
["Ingenieurwissenschaften","Projektmitarbeiter","IngenieurwissenschaftenProjektmitarbeiter","Allgemeine Verwaltung"]
["Ingenieurwissenschaften","Projektmitarbeiter","IngenieurwissenschaftenProjektmitarbeiter","Assistenz der Geschäftsleitung/ des Vorstands"]
["Ingenieurwissenschaften","Projektmitarbeiter",{"$f":"A517&B517&E517","v":"IngenieurwissenschaftenProjektmitarbeiter"},"Aus- und Weiterbildung"]
["Ingenieurwissenschaften","Projektmitarbeiter","IngenieurwissenschaftenProjektmitarbeiter","Bauleitung"]
["Ingenieurwissenschaften","Projektmitarbeiter","IngenieurwissenschaftenProjektmitarbeiter","Business Development"]
["Ingenieurwissenschaften","Projektmitarbeiter","IngenieurwissenschaftenProjektmitarbeiter","Consulting"]
["Ingenieurwissenschaften","Projektmitarbeiter","IngenieurwissenschaftenProjektmitarbeiter","Content Management"]
["Ingenieurwissenschaften","Projektmitarbeiter","IngenieurwissenschaftenProjektmitarbeiter","Controlling"]
["Ingenieurwissenschaften","Projektmitarbeiter","IngenieurwissenschaftenProjektmitarbeiter","Design und Gestaltung"]
["Ingenieurwissenschaften","Projektmitarbeiter","IngenieurwissenschaftenProjektmitarbeiter","Einkauf und Beschaffung"]
["Ingenieurwissenschaften","Projektmitarbeiter","IngenieurwissenschaftenProjektmitarbeiter","Engineering"]
["Ingenieurwissenschaften","Projektmitarbeiter","IngenieurwissenschaftenProjektmitarbeiter","Entwicklung"]
["Ingenieurwissenschaften","Projektmitarbeiter","IngenieurwissenschaftenProjektmitarbeiter","Facility Management"]
["Ingenieurwissenschaften","Projektmitarbeiter","IngenieurwissenschaftenProjektmitarbeiter","Finanzwesen"]
["Ingenieurwissenschaften","Projektmitarbeiter","IngenieurwissenschaftenProjektmitarbeiter","Forschung und Entwicklung"]
["Ingenieurwissenschaften","Projektmitarbeiter","IngenieurwissenschaftenProjektmitarbeiter","IT"]
["Ingenieurwissenschaften","Projektmitarbeiter","IngenieurwissenschaftenProjektmitarbeiter","IT-Consulting"]
["Ingenieurwissenschaften","Projektmitarbeiter","IngenieurwissenschaftenProjektmitarbeiter","Key Account Management"]
["Ingenieurwissenschaften","Projektmitarbeiter","IngenieurwissenschaftenProjektmitarbeiter","Konstruktion"]
["Ingenieurwissenschaften","Projektmitarbeiter","IngenieurwissenschaftenProjektmitarbeiter","Logistik"]
["Ingenieurwissenschaften","Projektmitarbeiter","IngenieurwissenschaftenProjektmitarbeiter","Marketing"]
["Ingenieurwissenschaften","Projektmitarbeiter","IngenieurwissenschaftenProjektmitarbeiter","Marktforschung"]
["Ingenieurwissenschaften","Projektmitarbeiter","IngenieurwissenschaftenProjektmitarbeiter","Mediengestaltung"]
["Ingenieurwissenschaften","Projektmitarbeiter","IngenieurwissenschaftenProjektmitarbeiter","Online-Marketing"]
["Ingenieurwissenschaften","Projektmitarbeiter","IngenieurwissenschaftenProjektmitarbeiter","Planung"]
["Ingenieurwissenschaften","Projektmitarbeiter","IngenieurwissenschaftenProjektmitarbeiter","Produktion und Fertigung"]
["Ingenieurwissenschaften","Projektmitarbeiter","IngenieurwissenschaftenProjektmitarbeiter","Produktmanagement"]
["Ingenieurwissenschaften","Projektmitarbeiter","IngenieurwissenschaftenProjektmitarbeiter","Projektmanagement"]
["Ingenieurwissenschaften","Projektmitarbeiter","IngenieurwissenschaftenProjektmitarbeiter","Prozessmanagement"]
["Ingenieurwissenschaften","Projektmitarbeiter","IngenieurwissenschaftenProjektmitarbeiter","Qualitätswesen"]
["Ingenieurwissenschaften","Projektmitarbeiter","IngenieurwissenschaftenProjektmitarbeiter","Redaktion"]
["Ingenieurwissenschaften","Projektmitarbeiter","IngenieurwissenschaftenProjektmitarbeiter","Softwareentwicklung"]
["Ingenieurwissenschaften","Projektmitarbeiter","IngenieurwissenschaftenProjektmitarbeiter","Strategieentwicklung"]
["Ingenieurwissenschaften","Projektmitarbeiter","IngenieurwissenschaftenProjektmitarbeiter","Strategisches Produktmanagement"]
["Ingenieurwissenschaften","Projektmitarbeiter","IngenieurwissenschaftenProjektmitarbeiter","Vertrieb-Außendienst"]
["Ingenieurwissenschaften","Projektmitarbeiter","IngenieurwissenschaftenProjektmitarbeiter","Vertrieb-Innendienst"]
["Ingenieurwissenschaften","Projektmitarbeiter","IngenieurwissenschaftenProjektmitarbeiter","Vertriebssteuerung"]
["Ingenieurwissenschaften","Prozessmanager","IngenieurwissenschaftenProzessmanager","Prozessmanagement"]
["Ingenieurwissenschaften","Prüfungsassistent","IngenieurwissenschaftenPrüfungsassistent","Bauleitung"]
["Ingenieurwissenschaften","Prüfungsassistent","IngenieurwissenschaftenPrüfungsassistent","Content Management"]
["Ingenieurwissenschaften","Prüfungsassistent","IngenieurwissenschaftenPrüfungsassistent","Controlling"]
["Ingenieurwissenschaften","Prüfungsassistent","IngenieurwissenschaftenPrüfungsassistent","Einkauf und Beschaffung"]
["Ingenieurwissenschaften","Prüfungsassistent","IngenieurwissenschaftenPrüfungsassistent","Engineering"]
["Ingenieurwissenschaften","Prüfungsassistent","IngenieurwissenschaftenPrüfungsassistent","Entwicklung"]
["Ingenieurwissenschaften","Prüfungsassistent","IngenieurwissenschaftenPrüfungsassistent","Finanzwesen"]
["Ingenieurwissenschaften","Prüfungsassistent","IngenieurwissenschaftenPrüfungsassistent","Konstruktion"]
["Ingenieurwissenschaften","Prüfungsassistent","IngenieurwissenschaftenPrüfungsassistent","Logistik"]
["Ingenieurwissenschaften","Prüfungsassistent","IngenieurwissenschaftenPrüfungsassistent","Produktion und Fertigung"]
["Ingenieurwissenschaften","Prüfungsassistent","IngenieurwissenschaftenPrüfungsassistent","Prozessmanagement"]
["Ingenieurwissenschaften","Prüfungsassistent","IngenieurwissenschaftenPrüfungsassistent","Qualitätswesen"]
["Ingenieurwissenschaften","Redakteur","IngenieurwissenschaftenRedakteur","Redaktion"]
["Ingenieurwissenschaften","Referent","IngenieurwissenschaftenReferent","Aus- und Weiterbildung"]
["Ingenieurwissenschaften","Referent","IngenieurwissenschaftenReferent","Controlling"]
["Ingenieurwissenschaften","Referent","IngenieurwissenschaftenReferent","Finanzwesen"]
["Ingenieurwissenschaften","Referent","IngenieurwissenschaftenReferent","Marketing"]
["Ingenieurwissenschaften","Sales_Manager","IngenieurwissenschaftenSales_Manager","Vertrieb-Außendienst"]
["Ingenieurwissenschaften","Softwareentwickler","IngenieurwissenschaftenSoftwareentwickler","IT"]
["Ingenieurwissenschaften","Softwareentwickler","IngenieurwissenschaftenSoftwareentwickler","IT-Consulting"]
["Ingenieurwissenschaften","Softwareentwickler","IngenieurwissenschaftenSoftwareentwickler","Projektmanagement"]
["Ingenieurwissenschaften","Softwareentwickler","IngenieurwissenschaftenSoftwareentwickler","Softwareentwicklung"]
["Ingenieurwissenschaften","Strategie_Consultant","IngenieurwissenschaftenStrategie_Consultant","Consulting"]
["Ingenieurwissenschaften","Strategie_Consultant","IngenieurwissenschaftenStrategie_Consultant","Strategieentwicklung"]
["Ingenieurwissenschaften","Technischer_Angestellter","IngenieurwissenschaftenTechnischer_Angestellter","Bauleitung"]
["Ingenieurwissenschaften","Technischer_Angestellter","IngenieurwissenschaftenTechnischer_Angestellter","Engineering"]
["Ingenieurwissenschaften","Technischer_Angestellter","IngenieurwissenschaftenTechnischer_Angestellter","Entwicklung"]
["Ingenieurwissenschaften","Technischer_Angestellter","IngenieurwissenschaftenTechnischer_Angestellter","Facility Management"]
["Ingenieurwissenschaften","Technischer_Angestellter",{"$f":"A581&B581&E581","v":"IngenieurwissenschaftenTechnischer_Angestellter"},"Forschung und Entwicklung"]
["Ingenieurwissenschaften","Technischer_Angestellter","IngenieurwissenschaftenTechnischer_Angestellter","IT"]
["Ingenieurwissenschaften","Technischer_Angestellter","IngenieurwissenschaftenTechnischer_Angestellter","Konstruktion"]
["Ingenieurwissenschaften","Technischer_Angestellter","IngenieurwissenschaftenTechnischer_Angestellter","Mediengestaltung"]
["Ingenieurwissenschaften","Technischer_Angestellter","IngenieurwissenschaftenTechnischer_Angestellter","Planung"]
["Ingenieurwissenschaften","Technischer_Angestellter","IngenieurwissenschaftenTechnischer_Angestellter","Produktion und Fertigung"]
["Ingenieurwissenschaften","Technischer_Angestellter","IngenieurwissenschaftenTechnischer_Angestellter","Projektmanagement"]
["Ingenieurwissenschaften","Technischer_Angestellter","IngenieurwissenschaftenTechnischer_Angestellter","Prozessmanagement"]
["Ingenieurwissenschaften","Trainee","IngenieurwissenschaftenTrainee","Account Management"]
["Ingenieurwissenschaften","Trainee","IngenieurwissenschaftenTrainee","Assistenz der Geschäftsleitung/ des Vorstands"]
["Ingenieurwissenschaften","Trainee","IngenieurwissenschaftenTrainee","Bauleitung"]
["Ingenieurwissenschaften","Trainee","IngenieurwissenschaftenTrainee","Business Development"]
["Ingenieurwissenschaften","Trainee","IngenieurwissenschaftenTrainee","Consulting"]
["Ingenieurwissenschaften","Trainee","IngenieurwissenschaftenTrainee","Content Management"]
["Ingenieurwissenschaften","Trainee","IngenieurwissenschaftenTrainee","Controlling"]
["Ingenieurwissenschaften","Trainee","IngenieurwissenschaftenTrainee","Design und Gestaltung"]
["Ingenieurwissenschaften","Trainee","IngenieurwissenschaftenTrainee","Einkauf und Beschaffung"]
["Ingenieurwissenschaften","Trainee","IngenieurwissenschaftenTrainee","Engineering"]
["Ingenieurwissenschaften","Trainee","IngenieurwissenschaftenTrainee","Entwicklung"]
["Ingenieurwissenschaften","Trainee","IngenieurwissenschaftenTrainee","Facility Management"]
["Ingenieurwissenschaften","Trainee","IngenieurwissenschaftenTrainee","Finanzwesen"]
["Ingenieurwissenschaften","Trainee","IngenieurwissenschaftenTrainee","Forschung und Entwicklung"]
["Ingenieurwissenschaften","Trainee","IngenieurwissenschaftenTrainee","IT"]
["Ingenieurwissenschaften","Trainee","IngenieurwissenschaftenTrainee","IT-Consulting"]
["Ingenieurwissenschaften","Trainee","IngenieurwissenschaftenTrainee","Key Account Management"]
["Ingenieurwissenschaften","Trainee","IngenieurwissenschaftenTrainee","Konstruktion"]
["Ingenieurwissenschaften","Trainee","IngenieurwissenschaftenTrainee","Logistik"]
["Ingenieurwissenschaften","Trainee","IngenieurwissenschaftenTrainee","Marketing"]
["Ingenieurwissenschaften","Trainee","IngenieurwissenschaftenTrainee","Marktforschung"]
["Ingenieurwissenschaften","Trainee","IngenieurwissenschaftenTrainee","Online-Marketing"]
["Ingenieurwissenschaften","Trainee","IngenieurwissenschaftenTrainee","Produktion und Fertigung"]
["Ingenieurwissenschaften","Trainee","IngenieurwissenschaftenTrainee","Produktmanagement"]
["Ingenieurwissenschaften","Trainee","IngenieurwissenschaftenTrainee","Projektmanagement"]
["Ingenieurwissenschaften","Trainee","IngenieurwissenschaftenTrainee","Prozessmanagement"]
["Ingenieurwissenschaften","Trainee","IngenieurwissenschaftenTrainee","Qualitätswesen"]
["Ingenieurwissenschaften","Trainee","IngenieurwissenschaftenTrainee","Redaktion"]
["Ingenieurwissenschaften","Trainee","IngenieurwissenschaftenTrainee","Softwareentwicklung"]
["Ingenieurwissenschaften","Trainee","IngenieurwissenschaftenTrainee","Strategieentwicklung"]
["Ingenieurwissenschaften","Trainee","IngenieurwissenschaftenTrainee","Strategisches Produktmanagement"]
["Ingenieurwissenschaften","Trainee","IngenieurwissenschaftenTrainee","Vertrieb-Außendienst"]
["Ingenieurwissenschaften","Trainee","IngenieurwissenschaftenTrainee","Vertrieb-Innendienst"]
["Ingenieurwissenschaften","Trainee","IngenieurwissenschaftenTrainee","Vertriebssteuerung"]
["Ingenieurwissenschaften","Trainee_Filialleiter/_Verkaufsleiter","IngenieurwissenschaftenTrainee_Filialleiter/_Verkaufsleiter","Vertrieb-Außendienst"]
["Ingenieurwissenschaften","Vertriebler","IngenieurwissenschaftenVertriebler","Vertrieb-Außendienst"]
["Ingenieurwissenschaften","Vertriebler","IngenieurwissenschaftenVertriebler","Key Account Management"]
["Ingenieurwissenschaften","Vertriebler","IngenieurwissenschaftenVertriebler","Account Management"]
["Ingenieurwissenschaften","Wissenschaftlicher_Mitarbeiter","IngenieurwissenschaftenWissenschaftlicher_Mitarbeiter","Forschung und Entwicklung"]
["Ingenieurwissenschaften","Wissenschaftlicher_Mitarbeiter","IngenieurwissenschaftenWissenschaftlicher_Mitarbeiter","Marktforschung"]
["Rechtswissenschaften","Account_Manager","RechtswissenschaftenAccount_Manager","Account Management"]
["Rechtswissenschaften","Assistent_der_Geschäftsleitung/_des_Vorstands","RechtswissenschaftenAssistent_der_Geschäftsleitung/_des_Vorstands","Assistenz der Geschäftsleitung/ des Vorstands"]
["Rechtswissenschaften","Associate","RechtswissenschaftenAssociate","Consulting"]
["Rechtswissenschaften","Associate","RechtswissenschaftenAssociate","Finanzwesen"]
["Rechtswissenschaften","Associate","RechtswissenschaftenAssociate","Recht"]
["Rechtswissenschaften","Associate","RechtswissenschaftenAssociate","Strategieentwicklung"]
["Rechtswissenschaften","Business_Development_Manager","RechtswissenschaftenBusiness_Development_Manager","Business Development"]
["Rechtswissenschaften","Consultant","RechtswissenschaftenConsultant","Business Development"]
["Rechtswissenschaften","Consultant","RechtswissenschaftenConsultant","Consulting"]
["Rechtswissenschaften","Consultant","RechtswissenschaftenConsultant","Finanzwesen"]
["Rechtswissenschaften","Consultant","RechtswissenschaftenConsultant","Strategieentwicklung"]
["Rechtswissenschaften","Content_Manager","RechtswissenschaftenContent_Manager","Content Management"]
["Rechtswissenschaften","Controller","RechtswissenschaftenController","Controlling"]
["Rechtswissenschaften","Controller","RechtswissenschaftenController","Finanzwesen"]
["Rechtswissenschaften","Controller","RechtswissenschaftenController","Risikomanagement"]
["Rechtswissenschaften","Controller","RechtswissenschaftenController","Vertriebssteuerung"]
["Rechtswissenschaften","Justiziar/_Syndikus",{"$f":"A645&B645&E645","v":"RechtswissenschaftenJustiziar/_Syndikus"},"Recht"]
["Rechtswissenschaften","Kaufmännischer_Angestellter","RechtswissenschaftenKaufmännischer_Angestellter","Account Management"]
["Rechtswissenschaften","Kaufmännischer_Angestellter","RechtswissenschaftenKaufmännischer_Angestellter","Allgemeine Verwaltung"]
["Rechtswissenschaften","Kaufmännischer_Angestellter","RechtswissenschaftenKaufmännischer_Angestellter","Assistenz der Geschäftsleitung/ des Vorstands"]
["Rechtswissenschaften","Kaufmännischer_Angestellter","RechtswissenschaftenKaufmännischer_Angestellter","Aus- und Weiterbildung"]
["Rechtswissenschaften","Kaufmännischer_Angestellter","RechtswissenschaftenKaufmännischer_Angestellter","Business Development"]
["Rechtswissenschaften","Kaufmännischer_Angestellter","RechtswissenschaftenKaufmännischer_Angestellter","Consulting"]
["Rechtswissenschaften","Kaufmännischer_Angestellter","RechtswissenschaftenKaufmännischer_Angestellter","Content Management"]
["Rechtswissenschaften","Kaufmännischer_Angestellter","RechtswissenschaftenKaufmännischer_Angestellter","Controlling"]
["Rechtswissenschaften","Kaufmännischer_Angestellter","RechtswissenschaftenKaufmännischer_Angestellter","Finanzwesen"]
["Rechtswissenschaften","Kaufmännischer_Angestellter","RechtswissenschaftenKaufmännischer_Angestellter","Forschung und Entwicklung"]
["Rechtswissenschaften","Kaufmännischer_Angestellter","RechtswissenschaftenKaufmännischer_Angestellter","Key Account Management"]
["Rechtswissenschaften","Kaufmännischer_Angestellter","RechtswissenschaftenKaufmännischer_Angestellter","Marketing"]
["Rechtswissenschaften","Kaufmännischer_Angestellter","RechtswissenschaftenKaufmännischer_Angestellter","Personalwesen"]
["Rechtswissenschaften","Kaufmännischer_Angestellter","RechtswissenschaftenKaufmännischer_Angestellter","Planung"]
["Rechtswissenschaften","Kaufmännischer_Angestellter","RechtswissenschaftenKaufmännischer_Angestellter","Produktmanagement"]
["Rechtswissenschaften","Kaufmännischer_Angestellter","RechtswissenschaftenKaufmännischer_Angestellter","Projektmanagement"]
["Rechtswissenschaften","Kaufmännischer_Angestellter","RechtswissenschaftenKaufmännischer_Angestellter","Prozessmanagement"]
["Rechtswissenschaften","Kaufmännischer_Angestellter","RechtswissenschaftenKaufmännischer_Angestellter","Public Relation und Unternehmenskommunikation"]
["Rechtswissenschaften","Kaufmännischer_Angestellter","RechtswissenschaftenKaufmännischer_Angestellter","Recht"]
["Rechtswissenschaften","Kaufmännischer_Angestellter","RechtswissenschaftenKaufmännischer_Angestellter","Redaktion"]
["Rechtswissenschaften","Kaufmännischer_Angestellter","RechtswissenschaftenKaufmännischer_Angestellter","Risikomanagement"]
["Rechtswissenschaften","Kaufmännischer_Angestellter","RechtswissenschaftenKaufmännischer_Angestellter","Steuer- und Wirtschaftsprüfung"]
["Rechtswissenschaften","Kaufmännischer_Angestellter","RechtswissenschaftenKaufmännischer_Angestellter","Strategieentwicklung"]
["Rechtswissenschaften","Kaufmännischer_Angestellter","RechtswissenschaftenKaufmännischer_Angestellter","Strategisches Produktmanagement"]
["Rechtswissenschaften","Kaufmännischer_Angestellter","RechtswissenschaftenKaufmännischer_Angestellter","Unternehmenskommunikation und Public Relation"]
["Rechtswissenschaften","Kaufmännischer_Angestellter","RechtswissenschaftenKaufmännischer_Angestellter","Vertrieb-Außendienst"]
["Rechtswissenschaften","Kaufmännischer_Angestellter","RechtswissenschaftenKaufmännischer_Angestellter","Vertrieb-Innendienst"]
["Rechtswissenschaften","Kaufmännischer_Angestellter","RechtswissenschaftenKaufmännischer_Angestellter","Vertriebssteuerung"]
["Rechtswissenschaften","Kaufmännischer_Angestellter","RechtswissenschaftenKaufmännischer_Angestellter","Wirtschafts- und Steuerprüfung"]
["Rechtswissenschaften","Key_Account_Manager","RechtswissenschaftenKey_Account_Manager","Key Account Management"]
["Rechtswissenschaften","Mitarbeiter","RechtswissenschaftenMitarbeiter","Account Management"]
["Rechtswissenschaften","Mitarbeiter","RechtswissenschaftenMitarbeiter","Allgemeine Verwaltung"]
["Rechtswissenschaften","Mitarbeiter","RechtswissenschaftenMitarbeiter","Assistenz der Geschäftsleitung/ des Vorstands"]
["Rechtswissenschaften","Mitarbeiter","RechtswissenschaftenMitarbeiter","Aus- und Weiterbildung"]
["Rechtswissenschaften","Mitarbeiter","RechtswissenschaftenMitarbeiter","Business Development"]
["Rechtswissenschaften","Mitarbeiter","RechtswissenschaftenMitarbeiter","Consulting"]
["Rechtswissenschaften","Mitarbeiter","RechtswissenschaftenMitarbeiter","Content Management"]
["Rechtswissenschaften","Mitarbeiter","RechtswissenschaftenMitarbeiter","Controlling"]
["Rechtswissenschaften","Mitarbeiter","RechtswissenschaftenMitarbeiter","Finanzwesen"]
["Rechtswissenschaften","Mitarbeiter","RechtswissenschaftenMitarbeiter","Forschung und Entwicklung"]
["Rechtswissenschaften","Mitarbeiter","RechtswissenschaftenMitarbeiter","Key Account Management"]
["Rechtswissenschaften","Mitarbeiter","RechtswissenschaftenMitarbeiter","Marketing"]
["Rechtswissenschaften","Mitarbeiter","RechtswissenschaftenMitarbeiter","Personalwesen"]
["Rechtswissenschaften","Mitarbeiter","RechtswissenschaftenMitarbeiter","Planung"]
["Rechtswissenschaften","Mitarbeiter","RechtswissenschaftenMitarbeiter","Produktmanagement"]
["Rechtswissenschaften","Mitarbeiter","RechtswissenschaftenMitarbeiter","Projektmanagement"]
["Rechtswissenschaften","Mitarbeiter","RechtswissenschaftenMitarbeiter","Prozessmanagement"]
["Rechtswissenschaften","Mitarbeiter","RechtswissenschaftenMitarbeiter","Public Relation und Unternehmenskommunikation"]
["Rechtswissenschaften","Mitarbeiter","RechtswissenschaftenMitarbeiter","Recht"]
["Rechtswissenschaften","Mitarbeiter","RechtswissenschaftenMitarbeiter","Redaktion"]
["Rechtswissenschaften","Mitarbeiter","RechtswissenschaftenMitarbeiter","Risikomanagement"]
["Rechtswissenschaften","Mitarbeiter","RechtswissenschaftenMitarbeiter","Steuer- und Wirtschaftsprüfung"]
["Rechtswissenschaften","Mitarbeiter","RechtswissenschaftenMitarbeiter","Strategieentwicklung"]
["Rechtswissenschaften","Mitarbeiter","RechtswissenschaftenMitarbeiter","Strategisches Produktmanagement"]
["Rechtswissenschaften","Mitarbeiter","RechtswissenschaftenMitarbeiter","Unternehmenskommunikation und Public Relation"]
["Rechtswissenschaften","Mitarbeiter","RechtswissenschaftenMitarbeiter","Vertrieb-Außendienst"]
["Rechtswissenschaften","Mitarbeiter","RechtswissenschaftenMitarbeiter","Vertrieb-Innendienst"]
["Rechtswissenschaften","Mitarbeiter","RechtswissenschaftenMitarbeiter","Vertriebssteuerung"]
["Rechtswissenschaften","Mitarbeiter","RechtswissenschaftenMitarbeiter","Wirtschafts- und Steuerprüfung"]
["Rechtswissenschaften","Personalreferent","RechtswissenschaftenPersonalreferent","Personalwesen"]
["Rechtswissenschaften","Projektleiter/_Projektmanager","RechtswissenschaftenProjektleiter/_Projektmanager","Aus- und Weiterbildung"]
["Rechtswissenschaften","Projektleiter/_Projektmanager","RechtswissenschaftenProjektleiter/_Projektmanager","Controlling"]
["Rechtswissenschaften","Projektleiter/_Projektmanager","RechtswissenschaftenProjektleiter/_Projektmanager","Finanzwesen"]
["Rechtswissenschaften","Projektleiter/_Projektmanager",{"$f":"A709&B709&E709","v":"RechtswissenschaftenProjektleiter/_Projektmanager"},"Forschung und Entwicklung"]
["Rechtswissenschaften","Projektleiter/_Projektmanager","RechtswissenschaftenProjektleiter/_Projektmanager","Marketing"]
["Rechtswissenschaften","Projektleiter/_Projektmanager","RechtswissenschaftenProjektleiter/_Projektmanager","Personalwesen"]
["Rechtswissenschaften","Projektleiter/_Projektmanager","RechtswissenschaftenProjektleiter/_Projektmanager","Planung"]
["Rechtswissenschaften","Projektleiter/_Projektmanager","RechtswissenschaftenProjektleiter/_Projektmanager","Projektmanagement"]
["Rechtswissenschaften","Projektleiter/_Projektmanager","RechtswissenschaftenProjektleiter/_Projektmanager","Public Relation und Unternehmenskommunikation"]
["Rechtswissenschaften","Projektleiter/_Projektmanager","RechtswissenschaftenProjektleiter/_Projektmanager","Risikomanagement"]
["Rechtswissenschaften","Projektleiter/_Projektmanager","RechtswissenschaftenProjektleiter/_Projektmanager","Unternehmenskommunikation und Public Relation"]
["Rechtswissenschaften","Projektleiter/_Projektmanager","RechtswissenschaftenProjektleiter/_Projektmanager","Vertrieb-Innendienst"]
["Rechtswissenschaften","Projektleiter/_Projektmanager","RechtswissenschaftenProjektleiter/_Projektmanager","Vertriebssteuerung"]
["Rechtswissenschaften","Projektmitarbeiter","RechtswissenschaftenProjektmitarbeiter","Account Management"]
["Rechtswissenschaften","Projektmitarbeiter","RechtswissenschaftenProjektmitarbeiter","Allgemeine Verwaltung"]
["Rechtswissenschaften","Projektmitarbeiter","RechtswissenschaftenProjektmitarbeiter","Assistenz der Geschäftsleitung/ des Vorstands"]
["Rechtswissenschaften","Projektmitarbeiter","RechtswissenschaftenProjektmitarbeiter","Aus- und Weiterbildung"]
["Rechtswissenschaften","Projektmitarbeiter","RechtswissenschaftenProjektmitarbeiter","Business Development"]
["Rechtswissenschaften","Projektmitarbeiter","RechtswissenschaftenProjektmitarbeiter","Consulting"]
["Rechtswissenschaften","Projektmitarbeiter","RechtswissenschaftenProjektmitarbeiter","Content Management"]
["Rechtswissenschaften","Projektmitarbeiter","RechtswissenschaftenProjektmitarbeiter","Controlling"]
["Rechtswissenschaften","Projektmitarbeiter","RechtswissenschaftenProjektmitarbeiter","Finanzwesen"]
["Rechtswissenschaften","Projektmitarbeiter","RechtswissenschaftenProjektmitarbeiter","Forschung und Entwicklung"]
["Rechtswissenschaften","Projektmitarbeiter","RechtswissenschaftenProjektmitarbeiter","Key Account Management"]
["Rechtswissenschaften","Projektmitarbeiter","RechtswissenschaftenProjektmitarbeiter","Marketing"]
["Rechtswissenschaften","Projektmitarbeiter","RechtswissenschaftenProjektmitarbeiter","Personalwesen"]
["Rechtswissenschaften","Projektmitarbeiter","RechtswissenschaftenProjektmitarbeiter","Planung"]
["Rechtswissenschaften","Projektmitarbeiter","RechtswissenschaftenProjektmitarbeiter","Produktmanagement"]
["Rechtswissenschaften","Projektmitarbeiter","RechtswissenschaftenProjektmitarbeiter","Projektmanagement"]
["Rechtswissenschaften","Projektmitarbeiter","RechtswissenschaftenProjektmitarbeiter","Prozessmanagement"]
["Rechtswissenschaften","Projektmitarbeiter","RechtswissenschaftenProjektmitarbeiter","Public Relation und Unternehmenskommunikation"]
["Rechtswissenschaften","Projektmitarbeiter","RechtswissenschaftenProjektmitarbeiter","Recht"]
["Rechtswissenschaften","Projektmitarbeiter","RechtswissenschaftenProjektmitarbeiter","Redaktion"]
["Rechtswissenschaften","Projektmitarbeiter","RechtswissenschaftenProjektmitarbeiter","Risikomanagement"]
["Rechtswissenschaften","Projektmitarbeiter","RechtswissenschaftenProjektmitarbeiter","Steuer- und Wirtschaftsprüfung"]
["Rechtswissenschaften","Projektmitarbeiter","RechtswissenschaftenProjektmitarbeiter","Strategieentwicklung"]
["Rechtswissenschaften","Projektmitarbeiter","RechtswissenschaftenProjektmitarbeiter","Strategisches Produktmanagement"]
["Rechtswissenschaften","Projektmitarbeiter","RechtswissenschaftenProjektmitarbeiter","Unternehmenskommunikation und Public Relation"]
["Rechtswissenschaften","Projektmitarbeiter","RechtswissenschaftenProjektmitarbeiter","Vertrieb-Außendienst"]
["Rechtswissenschaften","Projektmitarbeiter","RechtswissenschaftenProjektmitarbeiter","Vertrieb-Innendienst"]
["Rechtswissenschaften","Projektmitarbeiter","RechtswissenschaftenProjektmitarbeiter","Vertriebssteuerung"]
["Rechtswissenschaften","Projektmitarbeiter","RechtswissenschaftenProjektmitarbeiter","Wirtschafts- und Steuerprüfung"]
["Rechtswissenschaften","Prozessmanager","RechtswissenschaftenProzessmanager","Prozessmanagement"]
["Rechtswissenschaften","Prüfungsassistent","RechtswissenschaftenPrüfungsassistent","Content Management"]
["Rechtswissenschaften","Prüfungsassistent","RechtswissenschaftenPrüfungsassistent","Controlling"]
["Rechtswissenschaften","Prüfungsassistent","RechtswissenschaftenPrüfungsassistent","Finanzwesen"]
["Rechtswissenschaften","Prüfungsassistent","RechtswissenschaftenPrüfungsassistent","Prozessmanagement"]
["Rechtswissenschaften","Prüfungsassistent","RechtswissenschaftenPrüfungsassistent","Risikomanagement"]
["Rechtswissenschaften","Prüfungsassistent","RechtswissenschaftenPrüfungsassistent","Steuer- und Wirtschaftsprüfung"]
["Rechtswissenschaften","Prüfungsassistent","RechtswissenschaftenPrüfungsassistent","Wirtschafts- und Steuerprüfung"]
["Rechtswissenschaften","Rechtsanwalt","RechtswissenschaftenRechtsanwalt","Recht"]
["Rechtswissenschaften","Redakteur","RechtswissenschaftenRedakteur","Redaktion"]
["Rechtswissenschaften","Referent","RechtswissenschaftenReferent","Aus- und Weiterbildung"]
["Rechtswissenschaften","Referent","RechtswissenschaftenReferent","Controlling"]
["Rechtswissenschaften","Referent","RechtswissenschaftenReferent","Finanzwesen"]
["Rechtswissenschaften","Referent","RechtswissenschaftenReferent","Marketing"]
["Rechtswissenschaften","Referent","RechtswissenschaftenReferent","Personalwesen"]
["Rechtswissenschaften","Referent","RechtswissenschaftenReferent","Public Relation und Unternehmenskommunikation"]
["Rechtswissenschaften","Referent","RechtswissenschaftenReferent","Unternehmenskommunikation und Public Relation"]
["Rechtswissenschaften","Steuerassistent/_Wirtschaftsprüfungsassistent","RechtswissenschaftenSteuerassistent/_Wirtschaftsprüfungsassistent","Wirtschafts- und Steuerprüfung"]
["Rechtswissenschaften","Steuerassistent/_Wirtschaftsprüfungsassistent","RechtswissenschaftenSteuerassistent/_Wirtschaftsprüfungsassistent","Steuer- und Wirtschaftsprüfung"]
["Rechtswissenschaften","Strategie_Consultant","RechtswissenschaftenStrategie_Consultant","Consulting"]
["Rechtswissenschaften","Strategie_Consultant","RechtswissenschaftenStrategie_Consultant","Strategieentwicklung"]
["Rechtswissenschaften","Syndikus/_Justiziar","RechtswissenschaftenSyndikus/_Justiziar","Recht"]
["Rechtswissenschaften","Trainee","RechtswissenschaftenTrainee","Account Management"]
["Rechtswissenschaften","Trainee","RechtswissenschaftenTrainee","Assistenz der Geschäftsleitung/ des Vorstands"]
["Rechtswissenschaften","Trainee","RechtswissenschaftenTrainee","Business Development"]
["Rechtswissenschaften","Trainee",{"$f":"A773&B773&E773","v":"RechtswissenschaftenTrainee"},"Consulting"]
["Rechtswissenschaften","Trainee","RechtswissenschaftenTrainee","Content Management"]
["Rechtswissenschaften","Trainee","RechtswissenschaftenTrainee","Controlling"]
["Rechtswissenschaften","Trainee","RechtswissenschaftenTrainee","Finanzwesen"]
["Rechtswissenschaften","Trainee","RechtswissenschaftenTrainee","Forschung und Entwicklung"]
["Rechtswissenschaften","Trainee","RechtswissenschaftenTrainee","Key Account Management"]
["Rechtswissenschaften","Trainee","RechtswissenschaftenTrainee","Marketing"]
["Rechtswissenschaften","Trainee","RechtswissenschaftenTrainee","Personalwesen"]
["Rechtswissenschaften","Trainee","RechtswissenschaftenTrainee","Produktmanagement"]
["Rechtswissenschaften","Trainee","RechtswissenschaftenTrainee","Projektmanagement"]
["Rechtswissenschaften","Trainee","RechtswissenschaftenTrainee","Prozessmanagement"]
["Rechtswissenschaften","Trainee","RechtswissenschaftenTrainee","Public Relation und Unternehmenskommunikation"]
["Rechtswissenschaften","Trainee","RechtswissenschaftenTrainee","Recht"]
["Rechtswissenschaften","Trainee","RechtswissenschaftenTrainee","Redaktion"]
["Rechtswissenschaften","Trainee","RechtswissenschaftenTrainee","Risikomanagement"]
["Rechtswissenschaften","Trainee","RechtswissenschaftenTrainee","Strategieentwicklung"]
["Rechtswissenschaften","Trainee","RechtswissenschaftenTrainee","Strategisches Produktmanagement"]
["Rechtswissenschaften","Trainee","RechtswissenschaftenTrainee","Unternehmenskommunikation und Public Relation"]
["Rechtswissenschaften","Trainee","RechtswissenschaftenTrainee","Vertrieb-Außendienst"]
["Rechtswissenschaften","Trainee","RechtswissenschaftenTrainee","Vertrieb-Innendienst"]
["Rechtswissenschaften","Trainee","RechtswissenschaftenTrainee","Vertriebssteuerung"]
["Rechtswissenschaften","Vertriebler","RechtswissenschaftenVertriebler","Vertrieb-Außendienst"]
["Rechtswissenschaften","Vertriebler","RechtswissenschaftenVertriebler","Key Account Management"]
["Rechtswissenschaften","Vertriebler","RechtswissenschaftenVertriebler","Account Management"]
["Rechtswissenschaften","Wirtschaftsprüfungsassistent/_Steuerassistent","RechtswissenschaftenWirtschaftsprüfungsassistent/_Steuerassistent","Wirtschafts- und Steuerprüfung"]
["Rechtswissenschaften","Wirtschaftsprüfungsassistent/_Steuerassistent","RechtswissenschaftenWirtschaftsprüfungsassistent/_Steuerassistent","Steuer- und Wirtschaftsprüfung"]
["Rechtswissenschaften","Wissenschaftlicher_Mitarbeiter","RechtswissenschaftenWissenschaftlicher_Mitarbeiter","Forschung und Entwicklung"]
["Wirtschaftsinformatik","Account_Manager","WirtschaftsinformatikAccount_Manager","Account Management"]
["Wirtschaftsinformatik","Analyst","WirtschaftsinformatikAnalyst","Asset Management"]
["Wirtschaftsinformatik","Analyst","WirtschaftsinformatikAnalyst","Business Development"]
["Wirtschaftsinformatik","Analyst","WirtschaftsinformatikAnalyst","Controlling"]
["Wirtschaftsinformatik","Analyst","WirtschaftsinformatikAnalyst","Finanzwesen"]
["Wirtschaftsinformatik","Analyst","WirtschaftsinformatikAnalyst","Strategieentwicklung"]
["Wirtschaftsinformatik","Asset_Manager","WirtschaftsinformatikAsset_Manager","Asset Management"]
["Wirtschaftsinformatik","Assistent_der_Geschäftsleitung/_des_Vorstands","WirtschaftsinformatikAssistent_der_Geschäftsleitung/_des_Vorstands","Assistenz der Geschäftsleitung/ des Vorstands"]
["Wirtschaftsinformatik","Associate","WirtschaftsinformatikAssociate","Consulting"]
["Wirtschaftsinformatik","Associate","WirtschaftsinformatikAssociate","Finanzwesen"]
["Wirtschaftsinformatik","Associate","WirtschaftsinformatikAssociate","Strategieentwicklung"]
["Wirtschaftsinformatik","Business_Development_Manager","WirtschaftsinformatikBusiness_Development_Manager","Business Development"]
["Wirtschaftsinformatik","Consultant","WirtschaftsinformatikConsultant","Business Development"]
["Wirtschaftsinformatik","Consultant","WirtschaftsinformatikConsultant","Consulting"]
["Wirtschaftsinformatik","Consultant","WirtschaftsinformatikConsultant","Finanzwesen"]
["Wirtschaftsinformatik","Consultant","WirtschaftsinformatikConsultant","IT-Consulting"]
["Wirtschaftsinformatik","Consultant","WirtschaftsinformatikConsultant","Strategieentwicklung"]
["Wirtschaftsinformatik","Content_Manager","WirtschaftsinformatikContent_Manager","Content Management"]
["Wirtschaftsinformatik","Controller","WirtschaftsinformatikController","Controlling"]
["Wirtschaftsinformatik","Controller","WirtschaftsinformatikController","Einkauf und Beschaffung"]
["Wirtschaftsinformatik","Controller","WirtschaftsinformatikController","Finanzwesen"]
["Wirtschaftsinformatik","Controller","WirtschaftsinformatikController","Produktion und Fertigung"]
["Wirtschaftsinformatik","Controller","WirtschaftsinformatikController","Rechnungswesen"]
["Wirtschaftsinformatik","Controller","WirtschaftsinformatikController","Risikomanagement"]
["Wirtschaftsinformatik","Controller","WirtschaftsinformatikController","Vertriebssteuerung"]
["Wirtschaftsinformatik","Einkäufer","WirtschaftsinformatikEinkäufer","Einkauf und Beschaffung"]
["Wirtschaftsinformatik","Einkäufer","WirtschaftsinformatikEinkäufer","Produktmanagement"]
["Wirtschaftsinformatik","Entwickler","WirtschaftsinformatikEntwickler","Engineering"]
["Wirtschaftsinformatik","Entwickler","WirtschaftsinformatikEntwickler","Entwicklung"]
["Wirtschaftsinformatik","Entwickler","WirtschaftsinformatikEntwickler","Forschung und Entwicklung"]
["Wirtschaftsinformatik","Entwickler","WirtschaftsinformatikEntwickler","Konstruktion"]
["Wirtschaftsinformatik","Entwickler","WirtschaftsinformatikEntwickler","Mediengestaltung"]
["Wirtschaftsinformatik","Entwickler","WirtschaftsinformatikEntwickler","Projektmanagement"]
["Wirtschaftsinformatik","Entwickler","WirtschaftsinformatikEntwickler","Softwareentwicklung"]
["Wirtschaftsinformatik","Event_Manager","WirtschaftsinformatikEvent_Manager","Event Management"]
["Wirtschaftsinformatik","Kaufmännischer_Angestellter","WirtschaftsinformatikKaufmännischer_Angestellter","Account Management"]
["Wirtschaftsinformatik","Kaufmännischer_Angestellter","WirtschaftsinformatikKaufmännischer_Angestellter","Allgemeine Verwaltung"]
["Wirtschaftsinformatik","Kaufmännischer_Angestellter",{"$f":"A837&B837&E837","v":"WirtschaftsinformatikKaufmännischer_Angestellter"},"Asset Management"]
["Wirtschaftsinformatik","Kaufmännischer_Angestellter","WirtschaftsinformatikKaufmännischer_Angestellter","Assistenz der Geschäftsleitung/ des Vorstands"]
["Wirtschaftsinformatik","Kaufmännischer_Angestellter","WirtschaftsinformatikKaufmännischer_Angestellter","Aus- und Weiterbildung"]
["Wirtschaftsinformatik","Kaufmännischer_Angestellter","WirtschaftsinformatikKaufmännischer_Angestellter","Business Development"]
["Wirtschaftsinformatik","Kaufmännischer_Angestellter","WirtschaftsinformatikKaufmännischer_Angestellter","Consulting"]
["Wirtschaftsinformatik","Kaufmännischer_Angestellter","WirtschaftsinformatikKaufmännischer_Angestellter","Content Management"]
["Wirtschaftsinformatik","Kaufmännischer_Angestellter","WirtschaftsinformatikKaufmännischer_Angestellter","Controlling"]
["Wirtschaftsinformatik","Kaufmännischer_Angestellter","WirtschaftsinformatikKaufmännischer_Angestellter","Design und Gestaltung"]
["Wirtschaftsinformatik","Kaufmännischer_Angestellter","WirtschaftsinformatikKaufmännischer_Angestellter","Einkauf und Beschaffung"]
["Wirtschaftsinformatik","Kaufmännischer_Angestellter","WirtschaftsinformatikKaufmännischer_Angestellter","Engineering"]
["Wirtschaftsinformatik","Kaufmännischer_Angestellter","WirtschaftsinformatikKaufmännischer_Angestellter","Entwicklung"]
["Wirtschaftsinformatik","Kaufmännischer_Angestellter","WirtschaftsinformatikKaufmännischer_Angestellter","Event Management"]
["Wirtschaftsinformatik","Kaufmännischer_Angestellter","WirtschaftsinformatikKaufmännischer_Angestellter","Facility Management"]
["Wirtschaftsinformatik","Kaufmännischer_Angestellter","WirtschaftsinformatikKaufmännischer_Angestellter","Finanzwesen"]
["Wirtschaftsinformatik","Kaufmännischer_Angestellter","WirtschaftsinformatikKaufmännischer_Angestellter","Forschung und Entwicklung"]
["Wirtschaftsinformatik","Kaufmännischer_Angestellter","WirtschaftsinformatikKaufmännischer_Angestellter","Gesundheitsmanagement"]
["Wirtschaftsinformatik","Kaufmännischer_Angestellter","WirtschaftsinformatikKaufmännischer_Angestellter","IT"]
["Wirtschaftsinformatik","Kaufmännischer_Angestellter","WirtschaftsinformatikKaufmännischer_Angestellter","IT-Consulting"]
["Wirtschaftsinformatik","Kaufmännischer_Angestellter","WirtschaftsinformatikKaufmännischer_Angestellter","Key Account Management"]
["Wirtschaftsinformatik","Kaufmännischer_Angestellter","WirtschaftsinformatikKaufmännischer_Angestellter","Konstruktion"]
["Wirtschaftsinformatik","Kaufmännischer_Angestellter","WirtschaftsinformatikKaufmännischer_Angestellter","Logistik"]
["Wirtschaftsinformatik","Kaufmännischer_Angestellter","WirtschaftsinformatikKaufmännischer_Angestellter","Marketing"]
["Wirtschaftsinformatik","Kaufmännischer_Angestellter","WirtschaftsinformatikKaufmännischer_Angestellter","Marktforschung"]
["Wirtschaftsinformatik","Kaufmännischer_Angestellter","WirtschaftsinformatikKaufmännischer_Angestellter","Mediengestaltung"]
["Wirtschaftsinformatik","Kaufmännischer_Angestellter","WirtschaftsinformatikKaufmännischer_Angestellter","Online-Marketing"]
["Wirtschaftsinformatik","Kaufmännischer_Angestellter","WirtschaftsinformatikKaufmännischer_Angestellter","Planung"]
["Wirtschaftsinformatik","Kaufmännischer_Angestellter","WirtschaftsinformatikKaufmännischer_Angestellter","Portfoliomanagement"]
["Wirtschaftsinformatik","Kaufmännischer_Angestellter","WirtschaftsinformatikKaufmännischer_Angestellter","Produktion und Fertigung"]
["Wirtschaftsinformatik","Kaufmännischer_Angestellter","WirtschaftsinformatikKaufmännischer_Angestellter","Produktmanagement"]
["Wirtschaftsinformatik","Kaufmännischer_Angestellter","WirtschaftsinformatikKaufmännischer_Angestellter","Projektmanagement"]
["Wirtschaftsinformatik","Kaufmännischer_Angestellter","WirtschaftsinformatikKaufmännischer_Angestellter","Prozessmanagement"]
["Wirtschaftsinformatik","Kaufmännischer_Angestellter","WirtschaftsinformatikKaufmännischer_Angestellter","Qualitätswesen"]
["Wirtschaftsinformatik","Kaufmännischer_Angestellter","WirtschaftsinformatikKaufmännischer_Angestellter","Rechnungswesen"]
["Wirtschaftsinformatik","Kaufmännischer_Angestellter","WirtschaftsinformatikKaufmännischer_Angestellter","Redaktion"]
["Wirtschaftsinformatik","Kaufmännischer_Angestellter","WirtschaftsinformatikKaufmännischer_Angestellter","Risikomanagement"]
["Wirtschaftsinformatik","Kaufmännischer_Angestellter","WirtschaftsinformatikKaufmännischer_Angestellter","Softwareentwicklung"]
["Wirtschaftsinformatik","Kaufmännischer_Angestellter","WirtschaftsinformatikKaufmännischer_Angestellter","Strategieentwicklung"]
["Wirtschaftsinformatik","Kaufmännischer_Angestellter","WirtschaftsinformatikKaufmännischer_Angestellter","Strategisches Produktmanagement"]
["Wirtschaftsinformatik","Kaufmännischer_Angestellter","WirtschaftsinformatikKaufmännischer_Angestellter","Vertrieb-Außendienst"]
["Wirtschaftsinformatik","Kaufmännischer_Angestellter","WirtschaftsinformatikKaufmännischer_Angestellter","Vertrieb-Innendienst"]
["Wirtschaftsinformatik","Kaufmännischer_Angestellter","WirtschaftsinformatikKaufmännischer_Angestellter","Vertriebssteuerung"]
["Wirtschaftsinformatik","Key_Account_Manager","WirtschaftsinformatikKey_Account_Manager","Key Account Management"]
["Wirtschaftsinformatik","Konstrukteur","WirtschaftsinformatikKonstrukteur","Engineering"]
["Wirtschaftsinformatik","Konstrukteur","WirtschaftsinformatikKonstrukteur","Entwicklung"]
["Wirtschaftsinformatik","Konstrukteur","WirtschaftsinformatikKonstrukteur","Forschung und Entwicklung"]
["Wirtschaftsinformatik","Konstrukteur","WirtschaftsinformatikKonstrukteur","Konstruktion"]
["Wirtschaftsinformatik","Konstrukteur","WirtschaftsinformatikKonstrukteur","Produktion und Fertigung"]
["Wirtschaftsinformatik","Konstrukteur","WirtschaftsinformatikKonstrukteur","Projektmanagement"]
["Wirtschaftsinformatik","Mitarbeiter","WirtschaftsinformatikMitarbeiter","Account Management"]
["Wirtschaftsinformatik","Mitarbeiter","WirtschaftsinformatikMitarbeiter","Allgemeine Verwaltung"]
["Wirtschaftsinformatik","Mitarbeiter","WirtschaftsinformatikMitarbeiter","Asset Management"]
["Wirtschaftsinformatik","Mitarbeiter","WirtschaftsinformatikMitarbeiter","Assistenz der Geschäftsleitung/ des Vorstands"]
["Wirtschaftsinformatik","Mitarbeiter","WirtschaftsinformatikMitarbeiter","Aus- und Weiterbildung"]
["Wirtschaftsinformatik","Mitarbeiter","WirtschaftsinformatikMitarbeiter","Business Development"]
["Wirtschaftsinformatik","Mitarbeiter","WirtschaftsinformatikMitarbeiter","Consulting"]
["Wirtschaftsinformatik","Mitarbeiter","WirtschaftsinformatikMitarbeiter","Content Management"]
["Wirtschaftsinformatik","Mitarbeiter","WirtschaftsinformatikMitarbeiter","Controlling"]
["Wirtschaftsinformatik","Mitarbeiter","WirtschaftsinformatikMitarbeiter","Design und Gestaltung"]
["Wirtschaftsinformatik","Mitarbeiter","WirtschaftsinformatikMitarbeiter","Einkauf und Beschaffung"]
["Wirtschaftsinformatik","Mitarbeiter","WirtschaftsinformatikMitarbeiter","Engineering"]
["Wirtschaftsinformatik","Mitarbeiter","WirtschaftsinformatikMitarbeiter","Entwicklung"]
["Wirtschaftsinformatik","Mitarbeiter","WirtschaftsinformatikMitarbeiter","Event Management"]
["Wirtschaftsinformatik","Mitarbeiter","WirtschaftsinformatikMitarbeiter","Facility Management"]
["Wirtschaftsinformatik","Mitarbeiter","WirtschaftsinformatikMitarbeiter","Finanzwesen"]
["Wirtschaftsinformatik","Mitarbeiter",{"$f":"A901&B901&E901","v":"WirtschaftsinformatikMitarbeiter"},"Forschung und Entwicklung"]
["Wirtschaftsinformatik","Mitarbeiter","WirtschaftsinformatikMitarbeiter","Gesundheitsmanagement"]
["Wirtschaftsinformatik","Mitarbeiter","WirtschaftsinformatikMitarbeiter","IT"]
["Wirtschaftsinformatik","Mitarbeiter","WirtschaftsinformatikMitarbeiter","IT-Consulting"]
["Wirtschaftsinformatik","Mitarbeiter","WirtschaftsinformatikMitarbeiter","Key Account Management"]
["Wirtschaftsinformatik","Mitarbeiter","WirtschaftsinformatikMitarbeiter","Konstruktion"]
["Wirtschaftsinformatik","Mitarbeiter","WirtschaftsinformatikMitarbeiter","Logistik"]
["Wirtschaftsinformatik","Mitarbeiter","WirtschaftsinformatikMitarbeiter","Marketing"]
["Wirtschaftsinformatik","Mitarbeiter","WirtschaftsinformatikMitarbeiter","Marktforschung"]
["Wirtschaftsinformatik","Mitarbeiter","WirtschaftsinformatikMitarbeiter","Mediengestaltung"]
["Wirtschaftsinformatik","Mitarbeiter","WirtschaftsinformatikMitarbeiter","Online-Marketing"]
["Wirtschaftsinformatik","Mitarbeiter","WirtschaftsinformatikMitarbeiter","Planung"]
["Wirtschaftsinformatik","Mitarbeiter","WirtschaftsinformatikMitarbeiter","Portfoliomanagement"]
["Wirtschaftsinformatik","Mitarbeiter","WirtschaftsinformatikMitarbeiter","Produktion und Fertigung"]
["Wirtschaftsinformatik","Mitarbeiter","WirtschaftsinformatikMitarbeiter","Produktmanagement"]
["Wirtschaftsinformatik","Mitarbeiter","WirtschaftsinformatikMitarbeiter","Projektmanagement"]
["Wirtschaftsinformatik","Mitarbeiter","WirtschaftsinformatikMitarbeiter","Prozessmanagement"]
["Wirtschaftsinformatik","Mitarbeiter","WirtschaftsinformatikMitarbeiter","Qualitätswesen"]
["Wirtschaftsinformatik","Mitarbeiter","WirtschaftsinformatikMitarbeiter","Rechnungswesen"]
["Wirtschaftsinformatik","Mitarbeiter","WirtschaftsinformatikMitarbeiter","Redaktion"]
["Wirtschaftsinformatik","Mitarbeiter","WirtschaftsinformatikMitarbeiter","Risikomanagement"]
["Wirtschaftsinformatik","Mitarbeiter","WirtschaftsinformatikMitarbeiter","Softwareentwicklung"]
["Wirtschaftsinformatik","Mitarbeiter","WirtschaftsinformatikMitarbeiter","Strategieentwicklung"]
["Wirtschaftsinformatik","Mitarbeiter","WirtschaftsinformatikMitarbeiter","Strategisches Produktmanagement"]
["Wirtschaftsinformatik","Mitarbeiter","WirtschaftsinformatikMitarbeiter","Vertrieb-Außendienst"]
["Wirtschaftsinformatik","Mitarbeiter","WirtschaftsinformatikMitarbeiter","Vertrieb-Innendienst"]
["Wirtschaftsinformatik","Mitarbeiter","WirtschaftsinformatikMitarbeiter","Vertriebssteuerung"]
["Wirtschaftsinformatik","Portfoliomanager","WirtschaftsinformatikPortfoliomanager","Portfoliomanagement"]
["Wirtschaftsinformatik","Produkt_Manager","WirtschaftsinformatikProdukt_Manager","Einkauf und Beschaffung"]
["Wirtschaftsinformatik","Produkt_Manager","WirtschaftsinformatikProdukt_Manager","Produktmanagement"]
["Wirtschaftsinformatik","Produkt_Manager","WirtschaftsinformatikProdukt_Manager","Strategisches Produktmanagement"]
["Wirtschaftsinformatik","Projektingenieur","WirtschaftsinformatikProjektingenieur","Engineering"]
["Wirtschaftsinformatik","Projektingenieur","WirtschaftsinformatikProjektingenieur","Entwicklung"]
["Wirtschaftsinformatik","Projektingenieur","WirtschaftsinformatikProjektingenieur","Facility Management"]
["Wirtschaftsinformatik","Projektingenieur","WirtschaftsinformatikProjektingenieur","Forschung und Entwicklung"]
["Wirtschaftsinformatik","Projektingenieur","WirtschaftsinformatikProjektingenieur","IT"]
["Wirtschaftsinformatik","Projektingenieur","WirtschaftsinformatikProjektingenieur","Konstruktion"]
["Wirtschaftsinformatik","Projektingenieur","WirtschaftsinformatikProjektingenieur","Planung"]
["Wirtschaftsinformatik","Projektingenieur","WirtschaftsinformatikProjektingenieur","Produktion und Fertigung"]
["Wirtschaftsinformatik","Projektingenieur","WirtschaftsinformatikProjektingenieur","Projektmanagement"]
["Wirtschaftsinformatik","Projektingenieur","WirtschaftsinformatikProjektingenieur","Prozessmanagement"]
["Wirtschaftsinformatik","Projektingenieur","WirtschaftsinformatikProjektingenieur","Qualitätswesen"]
["Wirtschaftsinformatik","Projektingenieur","WirtschaftsinformatikProjektingenieur","Softwareentwicklung"]
["Wirtschaftsinformatik","Projektleiter/_Projektmanager","WirtschaftsinformatikProjektleiter/_Projektmanager","Aus- und Weiterbildung"]
["Wirtschaftsinformatik","Projektleiter/_Projektmanager","WirtschaftsinformatikProjektleiter/_Projektmanager","Controlling"]
["Wirtschaftsinformatik","Projektleiter/_Projektmanager","WirtschaftsinformatikProjektleiter/_Projektmanager","Design und Gestaltung"]
["Wirtschaftsinformatik","Projektleiter/_Projektmanager","WirtschaftsinformatikProjektleiter/_Projektmanager","Einkauf und Beschaffung"]
["Wirtschaftsinformatik","Projektleiter/_Projektmanager","WirtschaftsinformatikProjektleiter/_Projektmanager","Engineering"]
["Wirtschaftsinformatik","Projektleiter/_Projektmanager","WirtschaftsinformatikProjektleiter/_Projektmanager","Entwicklung"]
["Wirtschaftsinformatik","Projektleiter/_Projektmanager","WirtschaftsinformatikProjektleiter/_Projektmanager","Facility Management"]
["Wirtschaftsinformatik","Projektleiter/_Projektmanager","WirtschaftsinformatikProjektleiter/_Projektmanager","Finanzwesen"]
["Wirtschaftsinformatik","Projektleiter/_Projektmanager","WirtschaftsinformatikProjektleiter/_Projektmanager","Forschung und Entwicklung"]
["Wirtschaftsinformatik","Projektleiter/_Projektmanager","WirtschaftsinformatikProjektleiter/_Projektmanager","Gesundheitsmanagement"]
["Wirtschaftsinformatik","Projektleiter/_Projektmanager","WirtschaftsinformatikProjektleiter/_Projektmanager","IT"]
["Wirtschaftsinformatik","Projektleiter/_Projektmanager","WirtschaftsinformatikProjektleiter/_Projektmanager","IT-Consulting"]
["Wirtschaftsinformatik","Projektleiter/_Projektmanager","WirtschaftsinformatikProjektleiter/_Projektmanager","Konstruktion"]
["Wirtschaftsinformatik","Projektleiter/_Projektmanager","WirtschaftsinformatikProjektleiter/_Projektmanager","Logistik"]
["Wirtschaftsinformatik","Projektleiter/_Projektmanager","WirtschaftsinformatikProjektleiter/_Projektmanager","Marketing"]
["Wirtschaftsinformatik","Projektleiter/_Projektmanager","WirtschaftsinformatikProjektleiter/_Projektmanager","Marktforschung"]
["Wirtschaftsinformatik","Projektleiter/_Projektmanager","WirtschaftsinformatikProjektleiter/_Projektmanager","Mediengestaltung"]
["Wirtschaftsinformatik","Projektleiter/_Projektmanager","WirtschaftsinformatikProjektleiter/_Projektmanager","Online-Marketing"]
["Wirtschaftsinformatik","Projektleiter/_Projektmanager","WirtschaftsinformatikProjektleiter/_Projektmanager","Planung"]
["Wirtschaftsinformatik","Projektleiter/_Projektmanager","WirtschaftsinformatikProjektleiter/_Projektmanager","Produktion und Fertigung"]
["Wirtschaftsinformatik","Projektleiter/_Projektmanager","WirtschaftsinformatikProjektleiter/_Projektmanager","Projektmanagement"]
["Wirtschaftsinformatik","Projektleiter/_Projektmanager",{"$f":"A965&B965&E965","v":"WirtschaftsinformatikProjektleiter/_Projektmanager"},"Qualitätswesen"]
["Wirtschaftsinformatik","Projektleiter/_Projektmanager","WirtschaftsinformatikProjektleiter/_Projektmanager","Rechnungswesen"]
["Wirtschaftsinformatik","Projektleiter/_Projektmanager","WirtschaftsinformatikProjektleiter/_Projektmanager","Risikomanagement"]
["Wirtschaftsinformatik","Projektleiter/_Projektmanager","WirtschaftsinformatikProjektleiter/_Projektmanager","Softwareentwicklung"]
["Wirtschaftsinformatik","Projektleiter/_Projektmanager","WirtschaftsinformatikProjektleiter/_Projektmanager","Vertrieb-Innendienst"]
["Wirtschaftsinformatik","Projektleiter/_Projektmanager","WirtschaftsinformatikProjektleiter/_Projektmanager","Vertriebssteuerung"]
["Wirtschaftsinformatik","Projektmitarbeiter","WirtschaftsinformatikProjektmitarbeiter","Account Management"]
["Wirtschaftsinformatik","Projektmitarbeiter","WirtschaftsinformatikProjektmitarbeiter","Allgemeine Verwaltung"]
["Wirtschaftsinformatik","Projektmitarbeiter","WirtschaftsinformatikProjektmitarbeiter","Asset Management"]
["Wirtschaftsinformatik","Projektmitarbeiter","WirtschaftsinformatikProjektmitarbeiter","Assistenz der Geschäftsleitung/ des Vorstands"]
["Wirtschaftsinformatik","Projektmitarbeiter","WirtschaftsinformatikProjektmitarbeiter","Aus- und Weiterbildung"]
["Wirtschaftsinformatik","Projektmitarbeiter","WirtschaftsinformatikProjektmitarbeiter","Business Development"]
["Wirtschaftsinformatik","Projektmitarbeiter","WirtschaftsinformatikProjektmitarbeiter","Consulting"]
["Wirtschaftsinformatik","Projektmitarbeiter","WirtschaftsinformatikProjektmitarbeiter","Content Management"]
["Wirtschaftsinformatik","Projektmitarbeiter","WirtschaftsinformatikProjektmitarbeiter","Controlling"]
["Wirtschaftsinformatik","Projektmitarbeiter","WirtschaftsinformatikProjektmitarbeiter","Design und Gestaltung"]
["Wirtschaftsinformatik","Projektmitarbeiter","WirtschaftsinformatikProjektmitarbeiter","Einkauf und Beschaffung"]
["Wirtschaftsinformatik","Projektmitarbeiter","WirtschaftsinformatikProjektmitarbeiter","Engineering"]
["Wirtschaftsinformatik","Projektmitarbeiter","WirtschaftsinformatikProjektmitarbeiter","Entwicklung"]
["Wirtschaftsinformatik","Projektmitarbeiter","WirtschaftsinformatikProjektmitarbeiter","Event Management"]
["Wirtschaftsinformatik","Projektmitarbeiter","WirtschaftsinformatikProjektmitarbeiter","Facility Management"]
["Wirtschaftsinformatik","Projektmitarbeiter","WirtschaftsinformatikProjektmitarbeiter","Finanzwesen"]
["Wirtschaftsinformatik","Projektmitarbeiter","WirtschaftsinformatikProjektmitarbeiter","Forschung und Entwicklung"]
["Wirtschaftsinformatik","Projektmitarbeiter","WirtschaftsinformatikProjektmitarbeiter","Gesundheitsmanagement"]
["Wirtschaftsinformatik","Projektmitarbeiter","WirtschaftsinformatikProjektmitarbeiter","IT"]
["Wirtschaftsinformatik","Projektmitarbeiter","WirtschaftsinformatikProjektmitarbeiter","IT-Consulting"]
["Wirtschaftsinformatik","Projektmitarbeiter","WirtschaftsinformatikProjektmitarbeiter","Key Account Management"]
["Wirtschaftsinformatik","Projektmitarbeiter","WirtschaftsinformatikProjektmitarbeiter","Konstruktion"]
["Wirtschaftsinformatik","Projektmitarbeiter","WirtschaftsinformatikProjektmitarbeiter","Logistik"]
["Wirtschaftsinformatik","Projektmitarbeiter","WirtschaftsinformatikProjektmitarbeiter","Marketing"]
["Wirtschaftsinformatik","Projektmitarbeiter","WirtschaftsinformatikProjektmitarbeiter","Marktforschung"]
["Wirtschaftsinformatik","Projektmitarbeiter","WirtschaftsinformatikProjektmitarbeiter","Mediengestaltung"]
["Wirtschaftsinformatik","Projektmitarbeiter","WirtschaftsinformatikProjektmitarbeiter","Online-Marketing"]
["Wirtschaftsinformatik","Projektmitarbeiter","WirtschaftsinformatikProjektmitarbeiter","Planung"]
["Wirtschaftsinformatik","Projektmitarbeiter","WirtschaftsinformatikProjektmitarbeiter","Portfoliomanagement"]
["Wirtschaftsinformatik","Projektmitarbeiter","WirtschaftsinformatikProjektmitarbeiter","Produktion und Fertigung"]
["Wirtschaftsinformatik","Projektmitarbeiter","WirtschaftsinformatikProjektmitarbeiter","Produktmanagement"]
["Wirtschaftsinformatik","Projektmitarbeiter","WirtschaftsinformatikProjektmitarbeiter","Projektmanagement"]
["Wirtschaftsinformatik","Projektmitarbeiter","WirtschaftsinformatikProjektmitarbeiter","Prozessmanagement"]
["Wirtschaftsinformatik","Projektmitarbeiter","WirtschaftsinformatikProjektmitarbeiter","Qualitätswesen"]
["Wirtschaftsinformatik","Projektmitarbeiter","WirtschaftsinformatikProjektmitarbeiter","Rechnungswesen"]
["Wirtschaftsinformatik","Projektmitarbeiter","WirtschaftsinformatikProjektmitarbeiter","Redaktion"]
["Wirtschaftsinformatik","Projektmitarbeiter","WirtschaftsinformatikProjektmitarbeiter","Risikomanagement"]
["Wirtschaftsinformatik","Projektmitarbeiter","WirtschaftsinformatikProjektmitarbeiter","Softwareentwicklung"]
["Wirtschaftsinformatik","Projektmitarbeiter","WirtschaftsinformatikProjektmitarbeiter","Strategieentwicklung"]
["Wirtschaftsinformatik","Projektmitarbeiter","WirtschaftsinformatikProjektmitarbeiter","Strategisches Produktmanagement"]
["Wirtschaftsinformatik","Projektmitarbeiter","WirtschaftsinformatikProjektmitarbeiter","Vertrieb-Außendienst"]
["Wirtschaftsinformatik","Projektmitarbeiter","WirtschaftsinformatikProjektmitarbeiter","Vertrieb-Innendienst"]
["Wirtschaftsinformatik","Projektmitarbeiter","WirtschaftsinformatikProjektmitarbeiter","Vertriebssteuerung"]
["Wirtschaftsinformatik","Prozessmanager","WirtschaftsinformatikProzessmanager","Prozessmanagement"]
["Wirtschaftsinformatik","Prüfungsassistent","WirtschaftsinformatikPrüfungsassistent","Content Management"]
["Wirtschaftsinformatik","Prüfungsassistent","WirtschaftsinformatikPrüfungsassistent","Controlling"]
["Wirtschaftsinformatik","Prüfungsassistent","WirtschaftsinformatikPrüfungsassistent","Einkauf und Beschaffung"]
["Wirtschaftsinformatik","Prüfungsassistent","WirtschaftsinformatikPrüfungsassistent","Engineering"]
["Wirtschaftsinformatik","Prüfungsassistent","WirtschaftsinformatikPrüfungsassistent","Entwicklung"]
["Wirtschaftsinformatik","Prüfungsassistent","WirtschaftsinformatikPrüfungsassistent","Finanzwesen"]
["Wirtschaftsinformatik","Prüfungsassistent","WirtschaftsinformatikPrüfungsassistent","Gesundheitsmanagement"]
["Wirtschaftsinformatik","Prüfungsassistent","WirtschaftsinformatikPrüfungsassistent","Konstruktion"]
["Wirtschaftsinformatik","Prüfungsassistent","WirtschaftsinformatikPrüfungsassistent","Logistik"]
["Wirtschaftsinformatik","Prüfungsassistent","WirtschaftsinformatikPrüfungsassistent","Portfoliomanagement"]
["Wirtschaftsinformatik","Prüfungsassistent","WirtschaftsinformatikPrüfungsassistent","Produktion und Fertigung"]
["Wirtschaftsinformatik","Prüfungsassistent","WirtschaftsinformatikPrüfungsassistent","Prozessmanagement"]
["Wirtschaftsinformatik","Prüfungsassistent","WirtschaftsinformatikPrüfungsassistent","Qualitätswesen"]
["Wirtschaftsinformatik","Prüfungsassistent","WirtschaftsinformatikPrüfungsassistent","Rechnungswesen"]
["Wirtschaftsinformatik","Prüfungsassistent",{"$f":"A1029&B1029&E1029","v":"WirtschaftsinformatikPrüfungsassistent"},"Risikomanagement"]
["Wirtschaftsinformatik","Redakteur","WirtschaftsinformatikRedakteur","Redaktion"]
["Wirtschaftsinformatik","Referent","WirtschaftsinformatikReferent","Aus- und Weiterbildung"]
["Wirtschaftsinformatik","Referent","WirtschaftsinformatikReferent","Controlling"]
["Wirtschaftsinformatik","Referent","WirtschaftsinformatikReferent","Event Management"]
["Wirtschaftsinformatik","Referent","WirtschaftsinformatikReferent","Finanzwesen"]
["Wirtschaftsinformatik","Referent","WirtschaftsinformatikReferent","Gesundheitsmanagement"]
["Wirtschaftsinformatik","Referent","WirtschaftsinformatikReferent","Marketing"]
["Wirtschaftsinformatik","Referent","WirtschaftsinformatikReferent","Rechnungswesen"]
["Wirtschaftsinformatik","Sales_Manager","WirtschaftsinformatikSales_Manager","Vertrieb-Außendienst"]
["Wirtschaftsinformatik","Softwareentwickler","WirtschaftsinformatikSoftwareentwickler","IT"]
["Wirtschaftsinformatik","Softwareentwickler","WirtschaftsinformatikSoftwareentwickler","IT-Consulting"]
["Wirtschaftsinformatik","Softwareentwickler","WirtschaftsinformatikSoftwareentwickler","Projektmanagement"]
["Wirtschaftsinformatik","Softwareentwickler","WirtschaftsinformatikSoftwareentwickler","Softwareentwicklung"]
["Wirtschaftsinformatik","Strategie_Consultant","WirtschaftsinformatikStrategie_Consultant","Consulting"]
["Wirtschaftsinformatik","Strategie_Consultant","WirtschaftsinformatikStrategie_Consultant","Strategieentwicklung"]
["Wirtschaftsinformatik","Technischer_Angestellter","WirtschaftsinformatikTechnischer_Angestellter","Engineering"]
["Wirtschaftsinformatik","Technischer_Angestellter","WirtschaftsinformatikTechnischer_Angestellter","Entwicklung"]
["Wirtschaftsinformatik","Technischer_Angestellter","WirtschaftsinformatikTechnischer_Angestellter","Facility Management"]
["Wirtschaftsinformatik","Technischer_Angestellter","WirtschaftsinformatikTechnischer_Angestellter","Forschung und Entwicklung"]
["Wirtschaftsinformatik","Technischer_Angestellter","WirtschaftsinformatikTechnischer_Angestellter","IT"]
["Wirtschaftsinformatik","Technischer_Angestellter","WirtschaftsinformatikTechnischer_Angestellter","Konstruktion"]
["Wirtschaftsinformatik","Technischer_Angestellter","WirtschaftsinformatikTechnischer_Angestellter","Mediengestaltung"]
["Wirtschaftsinformatik","Technischer_Angestellter","WirtschaftsinformatikTechnischer_Angestellter","Planung"]
["Wirtschaftsinformatik","Technischer_Angestellter","WirtschaftsinformatikTechnischer_Angestellter","Produktion und Fertigung"]
["Wirtschaftsinformatik","Technischer_Angestellter","WirtschaftsinformatikTechnischer_Angestellter","Projektmanagement"]
["Wirtschaftsinformatik","Technischer_Angestellter","WirtschaftsinformatikTechnischer_Angestellter","Prozessmanagement"]
["Wirtschaftsinformatik","Trainee","WirtschaftsinformatikTrainee","Account Management"]
["Wirtschaftsinformatik","Trainee","WirtschaftsinformatikTrainee","Asset Management"]
["Wirtschaftsinformatik","Trainee","WirtschaftsinformatikTrainee","Assistenz der Geschäftsleitung/ des Vorstands"]
["Wirtschaftsinformatik","Trainee","WirtschaftsinformatikTrainee","Business Development"]
["Wirtschaftsinformatik","Trainee","WirtschaftsinformatikTrainee","Consulting"]
["Wirtschaftsinformatik","Trainee","WirtschaftsinformatikTrainee","Content Management"]
["Wirtschaftsinformatik","Trainee","WirtschaftsinformatikTrainee","Controlling"]
["Wirtschaftsinformatik","Trainee","WirtschaftsinformatikTrainee","Design und Gestaltung"]
["Wirtschaftsinformatik","Trainee","WirtschaftsinformatikTrainee","Einkauf und Beschaffung"]
["Wirtschaftsinformatik","Trainee","WirtschaftsinformatikTrainee","Engineering"]
["Wirtschaftsinformatik","Trainee","WirtschaftsinformatikTrainee","Entwicklung"]
["Wirtschaftsinformatik","Trainee","WirtschaftsinformatikTrainee","Event Management"]
["Wirtschaftsinformatik","Trainee","WirtschaftsinformatikTrainee","Facility Management"]
["Wirtschaftsinformatik","Trainee","WirtschaftsinformatikTrainee","Finanzwesen"]
["Wirtschaftsinformatik","Trainee","WirtschaftsinformatikTrainee","Forschung und Entwicklung"]
["Wirtschaftsinformatik","Trainee","WirtschaftsinformatikTrainee","Gesundheitsmanagement"]
["Wirtschaftsinformatik","Trainee","WirtschaftsinformatikTrainee","IT"]
["Wirtschaftsinformatik","Trainee","WirtschaftsinformatikTrainee","IT-Consulting"]
["Wirtschaftsinformatik","Trainee","WirtschaftsinformatikTrainee","Key Account Management"]
["Wirtschaftsinformatik","Trainee","WirtschaftsinformatikTrainee","Konstruktion"]
["Wirtschaftsinformatik","Trainee","WirtschaftsinformatikTrainee","Logistik"]
["Wirtschaftsinformatik","Trainee","WirtschaftsinformatikTrainee","Marketing"]
["Wirtschaftsinformatik","Trainee","WirtschaftsinformatikTrainee","Marktforschung"]
["Wirtschaftsinformatik","Trainee","WirtschaftsinformatikTrainee","Online-Marketing"]
["Wirtschaftsinformatik","Trainee","WirtschaftsinformatikTrainee","Portfoliomanagement"]
["Wirtschaftsinformatik","Trainee","WirtschaftsinformatikTrainee","Produktion und Fertigung"]
["Wirtschaftsinformatik","Trainee","WirtschaftsinformatikTrainee","Produktmanagement"]
["Wirtschaftsinformatik","Trainee","WirtschaftsinformatikTrainee","Projektmanagement"]
["Wirtschaftsinformatik","Trainee","WirtschaftsinformatikTrainee","Prozessmanagement"]
["Wirtschaftsinformatik","Trainee","WirtschaftsinformatikTrainee","Qualitätswesen"]
["Wirtschaftsinformatik","Trainee","WirtschaftsinformatikTrainee","Rechnungswesen"]
["Wirtschaftsinformatik","Trainee","WirtschaftsinformatikTrainee","Redaktion"]
["Wirtschaftsinformatik","Trainee","WirtschaftsinformatikTrainee","Risikomanagement"]
["Wirtschaftsinformatik","Trainee","WirtschaftsinformatikTrainee","Softwareentwicklung"]
["Wirtschaftsinformatik","Trainee","WirtschaftsinformatikTrainee","Strategieentwicklung"]
["Wirtschaftsinformatik","Trainee","WirtschaftsinformatikTrainee","Strategisches Produktmanagement"]
["Wirtschaftsinformatik","Trainee","WirtschaftsinformatikTrainee","Vertrieb-Außendienst"]
["Wirtschaftsinformatik","Trainee",{"$f":"A1093&B1093&E1093","v":"WirtschaftsinformatikTrainee"},"Vertrieb-Innendienst"]
["Wirtschaftsinformatik","Trainee","WirtschaftsinformatikTrainee","Vertriebssteuerung"]
["Wirtschaftsinformatik","Trainee_Filialleiter/_Verkaufsleiter","WirtschaftsinformatikTrainee_Filialleiter/_Verkaufsleiter","Vertrieb-Außendienst"]
["Wirtschaftsinformatik","Vertriebler","WirtschaftsinformatikVertriebler","Vertrieb-Außendienst"]
["Wirtschaftsinformatik","Vertriebler","WirtschaftsinformatikVertriebler","Key Account Management"]
["Wirtschaftsinformatik","Vertriebler","WirtschaftsinformatikVertriebler","Account Management"]
["Wirtschaftsinformatik","Wissenschaftlicher_Mitarbeiter","WirtschaftsinformatikWissenschaftlicher_Mitarbeiter","Forschung und Entwicklung"]
["Wirtschaftsinformatik","Wissenschaftlicher_Mitarbeiter","WirtschaftsinformatikWissenschaftlicher_Mitarbeiter","Marktforschung"]
["Wirtschaftsingenieurwesen","Account_Manager","WirtschaftsingenieurwesenAccount_Manager","Account Management"]
["Wirtschaftsingenieurwesen","Analyst","WirtschaftsingenieurwesenAnalyst","Asset Management"]
["Wirtschaftsingenieurwesen","Analyst","WirtschaftsingenieurwesenAnalyst","Business Development"]
["Wirtschaftsingenieurwesen","Analyst","WirtschaftsingenieurwesenAnalyst","Controlling"]
["Wirtschaftsingenieurwesen","Analyst","WirtschaftsingenieurwesenAnalyst","Finanzwesen"]
["Wirtschaftsingenieurwesen","Analyst","WirtschaftsingenieurwesenAnalyst","Strategieentwicklung"]
["Wirtschaftsingenieurwesen","Asset_Manager","WirtschaftsingenieurwesenAsset_Manager","Asset Management"]
["Wirtschaftsingenieurwesen","Assistent_der_Geschäftsleitung/_des_Vorstands","WirtschaftsingenieurwesenAssistent_der_Geschäftsleitung/_des_Vorstands","Assistenz der Geschäftsleitung/ des Vorstands"]
["Wirtschaftsingenieurwesen","Associate","WirtschaftsingenieurwesenAssociate","Consulting"]
["Wirtschaftsingenieurwesen","Associate","WirtschaftsingenieurwesenAssociate","Finanzwesen"]
["Wirtschaftsingenieurwesen","Associate","WirtschaftsingenieurwesenAssociate","Strategieentwicklung"]
["Wirtschaftsingenieurwesen","Bauleiter","WirtschaftsingenieurwesenBauleiter","Bauleitung"]
["Wirtschaftsingenieurwesen","Business_Development_Manager","WirtschaftsingenieurwesenBusiness_Development_Manager","Business Development"]
["Wirtschaftsingenieurwesen","Consultant","WirtschaftsingenieurwesenConsultant","Business Development"]
["Wirtschaftsingenieurwesen","Consultant","WirtschaftsingenieurwesenConsultant","Consulting"]
["Wirtschaftsingenieurwesen","Consultant","WirtschaftsingenieurwesenConsultant","Finanzwesen"]
["Wirtschaftsingenieurwesen","Consultant","WirtschaftsingenieurwesenConsultant","IT-Consulting"]
["Wirtschaftsingenieurwesen","Consultant","WirtschaftsingenieurwesenConsultant","Strategieentwicklung"]
["Wirtschaftsingenieurwesen","Content_Manager","WirtschaftsingenieurwesenContent_Manager","Content Management"]
["Wirtschaftsingenieurwesen","Controller","WirtschaftsingenieurwesenController","Controlling"]
["Wirtschaftsingenieurwesen","Controller","WirtschaftsingenieurwesenController","Einkauf und Beschaffung"]
["Wirtschaftsingenieurwesen","Controller","WirtschaftsingenieurwesenController","Finanzwesen"]
["Wirtschaftsingenieurwesen","Controller","WirtschaftsingenieurwesenController","Produktion und Fertigung"]
["Wirtschaftsingenieurwesen","Controller","WirtschaftsingenieurwesenController","Rechnungswesen"]
["Wirtschaftsingenieurwesen","Controller","WirtschaftsingenieurwesenController","Risikomanagement"]
["Wirtschaftsingenieurwesen","Controller","WirtschaftsingenieurwesenController","Vertriebssteuerung"]
["Wirtschaftsingenieurwesen","Einkäufer","WirtschaftsingenieurwesenEinkäufer","Einkauf und Beschaffung"]
["Wirtschaftsingenieurwesen","Einkäufer","WirtschaftsingenieurwesenEinkäufer","Produktmanagement"]
["Wirtschaftsingenieurwesen","Entwickler","WirtschaftsingenieurwesenEntwickler","Engineering"]
["Wirtschaftsingenieurwesen","Entwickler","WirtschaftsingenieurwesenEntwickler","Entwicklung"]
["Wirtschaftsingenieurwesen","Entwickler","WirtschaftsingenieurwesenEntwickler","Forschung und Entwicklung"]
["Wirtschaftsingenieurwesen","Entwickler","WirtschaftsingenieurwesenEntwickler","Konstruktion"]
["Wirtschaftsingenieurwesen","Entwickler","WirtschaftsingenieurwesenEntwickler","Mediengestaltung"]
["Wirtschaftsingenieurwesen","Entwickler","WirtschaftsingenieurwesenEntwickler","Projektmanagement"]
["Wirtschaftsingenieurwesen","Entwickler","WirtschaftsingenieurwesenEntwickler","Softwareentwicklung"]
["Wirtschaftsingenieurwesen","Event_Manager","WirtschaftsingenieurwesenEvent_Manager","Event Management"]
["Wirtschaftsingenieurwesen","Kaufmännischer_Angestellter","WirtschaftsingenieurwesenKaufmännischer_Angestellter","Account Management"]
["Wirtschaftsingenieurwesen","Kaufmännischer_Angestellter","WirtschaftsingenieurwesenKaufmännischer_Angestellter","Allgemeine Verwaltung"]
["Wirtschaftsingenieurwesen","Kaufmännischer_Angestellter","WirtschaftsingenieurwesenKaufmännischer_Angestellter","Asset Management"]
["Wirtschaftsingenieurwesen","Kaufmännischer_Angestellter","WirtschaftsingenieurwesenKaufmännischer_Angestellter","Assistenz der Geschäftsleitung/ des Vorstands"]
["Wirtschaftsingenieurwesen","Kaufmännischer_Angestellter","WirtschaftsingenieurwesenKaufmännischer_Angestellter","Aus- und Weiterbildung"]
["Wirtschaftsingenieurwesen","Kaufmännischer_Angestellter","WirtschaftsingenieurwesenKaufmännischer_Angestellter","Bauleitung"]
["Wirtschaftsingenieurwesen","Kaufmännischer_Angestellter","WirtschaftsingenieurwesenKaufmännischer_Angestellter","Business Development"]
["Wirtschaftsingenieurwesen","Kaufmännischer_Angestellter","WirtschaftsingenieurwesenKaufmännischer_Angestellter","Consulting"]
["Wirtschaftsingenieurwesen","Kaufmännischer_Angestellter","WirtschaftsingenieurwesenKaufmännischer_Angestellter","Content Management"]
["Wirtschaftsingenieurwesen","Kaufmännischer_Angestellter","WirtschaftsingenieurwesenKaufmännischer_Angestellter","Controlling"]
["Wirtschaftsingenieurwesen","Kaufmännischer_Angestellter","WirtschaftsingenieurwesenKaufmännischer_Angestellter","Design und Gestaltung"]
["Wirtschaftsingenieurwesen","Kaufmännischer_Angestellter","WirtschaftsingenieurwesenKaufmännischer_Angestellter","Einkauf und Beschaffung"]
["Wirtschaftsingenieurwesen","Kaufmännischer_Angestellter","WirtschaftsingenieurwesenKaufmännischer_Angestellter","Engineering"]
["Wirtschaftsingenieurwesen","Kaufmännischer_Angestellter","WirtschaftsingenieurwesenKaufmännischer_Angestellter","Entwicklung"]
["Wirtschaftsingenieurwesen","Kaufmännischer_Angestellter","WirtschaftsingenieurwesenKaufmännischer_Angestellter","Event Management"]
["Wirtschaftsingenieurwesen","Kaufmännischer_Angestellter","WirtschaftsingenieurwesenKaufmännischer_Angestellter","Facility Management"]
["Wirtschaftsingenieurwesen","Kaufmännischer_Angestellter","WirtschaftsingenieurwesenKaufmännischer_Angestellter","Finanzwesen"]
["Wirtschaftsingenieurwesen","Kaufmännischer_Angestellter","WirtschaftsingenieurwesenKaufmännischer_Angestellter","Forschung und Entwicklung"]
["Wirtschaftsingenieurwesen","Kaufmännischer_Angestellter","WirtschaftsingenieurwesenKaufmännischer_Angestellter","Gesundheitsmanagement"]
["Wirtschaftsingenieurwesen","Kaufmännischer_Angestellter","WirtschaftsingenieurwesenKaufmännischer_Angestellter","IT"]
["Wirtschaftsingenieurwesen","Kaufmännischer_Angestellter",{"$f":"A1157&B1157&E1157","v":"WirtschaftsingenieurwesenKaufmännischer_Angestellter"},"IT-Consulting"]
["Wirtschaftsingenieurwesen","Kaufmännischer_Angestellter","WirtschaftsingenieurwesenKaufmännischer_Angestellter","Key Account Management"]
["Wirtschaftsingenieurwesen","Kaufmännischer_Angestellter","WirtschaftsingenieurwesenKaufmännischer_Angestellter","Konstruktion"]
["Wirtschaftsingenieurwesen","Kaufmännischer_Angestellter","WirtschaftsingenieurwesenKaufmännischer_Angestellter","Logistik"]
["Wirtschaftsingenieurwesen","Kaufmännischer_Angestellter","WirtschaftsingenieurwesenKaufmännischer_Angestellter","Marketing"]
["Wirtschaftsingenieurwesen","Kaufmännischer_Angestellter","WirtschaftsingenieurwesenKaufmännischer_Angestellter","Marktforschung"]
["Wirtschaftsingenieurwesen","Kaufmännischer_Angestellter","WirtschaftsingenieurwesenKaufmännischer_Angestellter","Mediengestaltung"]
["Wirtschaftsingenieurwesen","Kaufmännischer_Angestellter","WirtschaftsingenieurwesenKaufmännischer_Angestellter","Online-Marketing"]
["Wirtschaftsingenieurwesen","Kaufmännischer_Angestellter","WirtschaftsingenieurwesenKaufmännischer_Angestellter","Personalwesen"]
["Wirtschaftsingenieurwesen","Kaufmännischer_Angestellter","WirtschaftsingenieurwesenKaufmännischer_Angestellter","Planung"]
["Wirtschaftsingenieurwesen","Kaufmännischer_Angestellter","WirtschaftsingenieurwesenKaufmännischer_Angestellter","Portfoliomanagement"]
["Wirtschaftsingenieurwesen","Kaufmännischer_Angestellter","WirtschaftsingenieurwesenKaufmännischer_Angestellter","Produktion und Fertigung"]
["Wirtschaftsingenieurwesen","Kaufmännischer_Angestellter","WirtschaftsingenieurwesenKaufmännischer_Angestellter","Produktmanagement"]
["Wirtschaftsingenieurwesen","Kaufmännischer_Angestellter","WirtschaftsingenieurwesenKaufmännischer_Angestellter","Projektmanagement"]
["Wirtschaftsingenieurwesen","Kaufmännischer_Angestellter","WirtschaftsingenieurwesenKaufmännischer_Angestellter","Prozessmanagement"]
["Wirtschaftsingenieurwesen","Kaufmännischer_Angestellter","WirtschaftsingenieurwesenKaufmännischer_Angestellter","Public Relation und Unternehmenskommunikation"]
["Wirtschaftsingenieurwesen","Kaufmännischer_Angestellter","WirtschaftsingenieurwesenKaufmännischer_Angestellter","Qualitätswesen"]
["Wirtschaftsingenieurwesen","Kaufmännischer_Angestellter","WirtschaftsingenieurwesenKaufmännischer_Angestellter","Rechnungswesen"]
["Wirtschaftsingenieurwesen","Kaufmännischer_Angestellter","WirtschaftsingenieurwesenKaufmännischer_Angestellter","Redaktion"]
["Wirtschaftsingenieurwesen","Kaufmännischer_Angestellter","WirtschaftsingenieurwesenKaufmännischer_Angestellter","Risikomanagement"]
["Wirtschaftsingenieurwesen","Kaufmännischer_Angestellter","WirtschaftsingenieurwesenKaufmännischer_Angestellter","Softwareentwicklung"]
["Wirtschaftsingenieurwesen","Kaufmännischer_Angestellter","WirtschaftsingenieurwesenKaufmännischer_Angestellter","Steuer- und Wirtschaftsprüfung"]
["Wirtschaftsingenieurwesen","Kaufmännischer_Angestellter","WirtschaftsingenieurwesenKaufmännischer_Angestellter","Strategieentwicklung"]
["Wirtschaftsingenieurwesen","Kaufmännischer_Angestellter","WirtschaftsingenieurwesenKaufmännischer_Angestellter","Strategisches Produktmanagement"]
["Wirtschaftsingenieurwesen","Kaufmännischer_Angestellter","WirtschaftsingenieurwesenKaufmännischer_Angestellter","Unternehmenskommunikation und Public Relation"]
["Wirtschaftsingenieurwesen","Kaufmännischer_Angestellter","WirtschaftsingenieurwesenKaufmännischer_Angestellter","Vertrieb-Außendienst"]
["Wirtschaftsingenieurwesen","Kaufmännischer_Angestellter","WirtschaftsingenieurwesenKaufmännischer_Angestellter","Vertrieb-Innendienst"]
["Wirtschaftsingenieurwesen","Kaufmännischer_Angestellter","WirtschaftsingenieurwesenKaufmännischer_Angestellter","Vertriebssteuerung"]
["Wirtschaftsingenieurwesen","Kaufmännischer_Angestellter","WirtschaftsingenieurwesenKaufmännischer_Angestellter","Wirtschafts- und Steuerprüfung"]
["Wirtschaftsingenieurwesen","Key_Account_Manager","WirtschaftsingenieurwesenKey_Account_Manager","Key Account Management"]
["Wirtschaftsingenieurwesen","Konstrukteur","WirtschaftsingenieurwesenKonstrukteur","Engineering"]
["Wirtschaftsingenieurwesen","Konstrukteur","WirtschaftsingenieurwesenKonstrukteur","Entwicklung"]
["Wirtschaftsingenieurwesen","Konstrukteur","WirtschaftsingenieurwesenKonstrukteur","Forschung und Entwicklung"]
["Wirtschaftsingenieurwesen","Konstrukteur","WirtschaftsingenieurwesenKonstrukteur","Konstruktion"]
["Wirtschaftsingenieurwesen","Konstrukteur","WirtschaftsingenieurwesenKonstrukteur","Produktion und Fertigung"]
["Wirtschaftsingenieurwesen","Konstrukteur","WirtschaftsingenieurwesenKonstrukteur","Projektmanagement"]
["Wirtschaftsingenieurwesen","Mitarbeiter","WirtschaftsingenieurwesenMitarbeiter","Account Management"]
["Wirtschaftsingenieurwesen","Mitarbeiter","WirtschaftsingenieurwesenMitarbeiter","Allgemeine Verwaltung"]
["Wirtschaftsingenieurwesen","Mitarbeiter","WirtschaftsingenieurwesenMitarbeiter","Asset Management"]
["Wirtschaftsingenieurwesen","Mitarbeiter","WirtschaftsingenieurwesenMitarbeiter","Assistenz der Geschäftsleitung/ des Vorstands"]
["Wirtschaftsingenieurwesen","Mitarbeiter","WirtschaftsingenieurwesenMitarbeiter","Aus- und Weiterbildung"]
["Wirtschaftsingenieurwesen","Mitarbeiter","WirtschaftsingenieurwesenMitarbeiter","Bauleitung"]
["Wirtschaftsingenieurwesen","Mitarbeiter","WirtschaftsingenieurwesenMitarbeiter","Business Development"]
["Wirtschaftsingenieurwesen","Mitarbeiter","WirtschaftsingenieurwesenMitarbeiter","Consulting"]
["Wirtschaftsingenieurwesen","Mitarbeiter","WirtschaftsingenieurwesenMitarbeiter","Content Management"]
["Wirtschaftsingenieurwesen","Mitarbeiter","WirtschaftsingenieurwesenMitarbeiter","Controlling"]
["Wirtschaftsingenieurwesen","Mitarbeiter","WirtschaftsingenieurwesenMitarbeiter","Design und Gestaltung"]
["Wirtschaftsingenieurwesen","Mitarbeiter","WirtschaftsingenieurwesenMitarbeiter","Einkauf und Beschaffung"]
["Wirtschaftsingenieurwesen","Mitarbeiter","WirtschaftsingenieurwesenMitarbeiter","Engineering"]
["Wirtschaftsingenieurwesen","Mitarbeiter","WirtschaftsingenieurwesenMitarbeiter","Entwicklung"]
["Wirtschaftsingenieurwesen","Mitarbeiter","WirtschaftsingenieurwesenMitarbeiter","Event Management"]
["Wirtschaftsingenieurwesen","Mitarbeiter","WirtschaftsingenieurwesenMitarbeiter","Facility Management"]
["Wirtschaftsingenieurwesen","Mitarbeiter","WirtschaftsingenieurwesenMitarbeiter","Finanzwesen"]
["Wirtschaftsingenieurwesen","Mitarbeiter","WirtschaftsingenieurwesenMitarbeiter","Forschung und Entwicklung"]
["Wirtschaftsingenieurwesen","Mitarbeiter","WirtschaftsingenieurwesenMitarbeiter","Gesundheitsmanagement"]
["Wirtschaftsingenieurwesen","Mitarbeiter","WirtschaftsingenieurwesenMitarbeiter","IT"]
["Wirtschaftsingenieurwesen","Mitarbeiter","WirtschaftsingenieurwesenMitarbeiter","IT-Consulting"]
["Wirtschaftsingenieurwesen","Mitarbeiter","WirtschaftsingenieurwesenMitarbeiter","Key Account Management"]
["Wirtschaftsingenieurwesen","Mitarbeiter","WirtschaftsingenieurwesenMitarbeiter","Konstruktion"]
["Wirtschaftsingenieurwesen","Mitarbeiter","WirtschaftsingenieurwesenMitarbeiter","Logistik"]
["Wirtschaftsingenieurwesen","Mitarbeiter","WirtschaftsingenieurwesenMitarbeiter","Marketing"]
["Wirtschaftsingenieurwesen","Mitarbeiter","WirtschaftsingenieurwesenMitarbeiter","Marktforschung"]
["Wirtschaftsingenieurwesen","Mitarbeiter","WirtschaftsingenieurwesenMitarbeiter","Mediengestaltung"]
["Wirtschaftsingenieurwesen","Mitarbeiter","WirtschaftsingenieurwesenMitarbeiter","Online-Marketing"]
["Wirtschaftsingenieurwesen","Mitarbeiter",{"$f":"A1221&B1221&E1221","v":"WirtschaftsingenieurwesenMitarbeiter"},"Personalwesen"]
["Wirtschaftsingenieurwesen","Mitarbeiter","WirtschaftsingenieurwesenMitarbeiter","Planung"]
["Wirtschaftsingenieurwesen","Mitarbeiter","WirtschaftsingenieurwesenMitarbeiter","Portfoliomanagement"]
["Wirtschaftsingenieurwesen","Mitarbeiter","WirtschaftsingenieurwesenMitarbeiter","Produktion und Fertigung"]
["Wirtschaftsingenieurwesen","Mitarbeiter","WirtschaftsingenieurwesenMitarbeiter","Produktmanagement"]
["Wirtschaftsingenieurwesen","Mitarbeiter","WirtschaftsingenieurwesenMitarbeiter","Projektmanagement"]
["Wirtschaftsingenieurwesen","Mitarbeiter","WirtschaftsingenieurwesenMitarbeiter","Prozessmanagement"]
["Wirtschaftsingenieurwesen","Mitarbeiter","WirtschaftsingenieurwesenMitarbeiter","Public Relation und Unternehmenskommunikation"]
["Wirtschaftsingenieurwesen","Mitarbeiter","WirtschaftsingenieurwesenMitarbeiter","Qualitätswesen"]
["Wirtschaftsingenieurwesen","Mitarbeiter","WirtschaftsingenieurwesenMitarbeiter","Rechnungswesen"]
["Wirtschaftsingenieurwesen","Mitarbeiter","WirtschaftsingenieurwesenMitarbeiter","Redaktion"]
["Wirtschaftsingenieurwesen","Mitarbeiter","WirtschaftsingenieurwesenMitarbeiter","Risikomanagement"]
["Wirtschaftsingenieurwesen","Mitarbeiter","WirtschaftsingenieurwesenMitarbeiter","Softwareentwicklung"]
["Wirtschaftsingenieurwesen","Mitarbeiter","WirtschaftsingenieurwesenMitarbeiter","Steuer- und Wirtschaftsprüfung"]
["Wirtschaftsingenieurwesen","Mitarbeiter","WirtschaftsingenieurwesenMitarbeiter","Strategieentwicklung"]
["Wirtschaftsingenieurwesen","Mitarbeiter","WirtschaftsingenieurwesenMitarbeiter","Strategisches Produktmanagement"]
["Wirtschaftsingenieurwesen","Mitarbeiter","WirtschaftsingenieurwesenMitarbeiter","Unternehmenskommunikation und Public Relation"]
["Wirtschaftsingenieurwesen","Mitarbeiter","WirtschaftsingenieurwesenMitarbeiter","Vertrieb-Außendienst"]
["Wirtschaftsingenieurwesen","Mitarbeiter","WirtschaftsingenieurwesenMitarbeiter","Vertrieb-Innendienst"]
["Wirtschaftsingenieurwesen","Mitarbeiter","WirtschaftsingenieurwesenMitarbeiter","Vertriebssteuerung"]
["Wirtschaftsingenieurwesen","Mitarbeiter","WirtschaftsingenieurwesenMitarbeiter","Wirtschafts- und Steuerprüfung"]
["Wirtschaftsingenieurwesen","Personalreferent","WirtschaftsingenieurwesenPersonalreferent","Personalwesen"]
["Wirtschaftsingenieurwesen","Portfoliomanager","WirtschaftsingenieurwesenPortfoliomanager","Portfoliomanagement"]
["Wirtschaftsingenieurwesen","Produkt_Manager","WirtschaftsingenieurwesenProdukt_Manager","Einkauf und Beschaffung"]
["Wirtschaftsingenieurwesen","Produkt_Manager","WirtschaftsingenieurwesenProdukt_Manager","Produktmanagement"]
["Wirtschaftsingenieurwesen","Produkt_Manager","WirtschaftsingenieurwesenProdukt_Manager","Strategisches Produktmanagement"]
["Wirtschaftsingenieurwesen","Projektingenieur","WirtschaftsingenieurwesenProjektingenieur","Bauleitung"]
["Wirtschaftsingenieurwesen","Projektingenieur","WirtschaftsingenieurwesenProjektingenieur","Engineering"]
["Wirtschaftsingenieurwesen","Projektingenieur","WirtschaftsingenieurwesenProjektingenieur","Entwicklung"]
["Wirtschaftsingenieurwesen","Projektingenieur","WirtschaftsingenieurwesenProjektingenieur","Facility Management"]
["Wirtschaftsingenieurwesen","Projektingenieur","WirtschaftsingenieurwesenProjektingenieur","Forschung und Entwicklung"]
["Wirtschaftsingenieurwesen","Projektingenieur","WirtschaftsingenieurwesenProjektingenieur","IT"]
["Wirtschaftsingenieurwesen","Projektingenieur","WirtschaftsingenieurwesenProjektingenieur","Konstruktion"]
["Wirtschaftsingenieurwesen","Projektingenieur","WirtschaftsingenieurwesenProjektingenieur","Planung"]
["Wirtschaftsingenieurwesen","Projektingenieur","WirtschaftsingenieurwesenProjektingenieur","Produktion und Fertigung"]
["Wirtschaftsingenieurwesen","Projektingenieur","WirtschaftsingenieurwesenProjektingenieur","Projektmanagement"]
["Wirtschaftsingenieurwesen","Projektingenieur","WirtschaftsingenieurwesenProjektingenieur","Prozessmanagement"]
["Wirtschaftsingenieurwesen","Projektingenieur","WirtschaftsingenieurwesenProjektingenieur","Qualitätswesen"]
["Wirtschaftsingenieurwesen","Projektingenieur","WirtschaftsingenieurwesenProjektingenieur","Softwareentwicklung"]
["Wirtschaftsingenieurwesen","Projektleiter/_Projektmanager","WirtschaftsingenieurwesenProjektleiter/_Projektmanager","Aus- und Weiterbildung"]
["Wirtschaftsingenieurwesen","Projektleiter/_Projektmanager","WirtschaftsingenieurwesenProjektleiter/_Projektmanager","Controlling"]
["Wirtschaftsingenieurwesen","Projektleiter/_Projektmanager","WirtschaftsingenieurwesenProjektleiter/_Projektmanager","Design und Gestaltung"]
["Wirtschaftsingenieurwesen","Projektleiter/_Projektmanager","WirtschaftsingenieurwesenProjektleiter/_Projektmanager","Einkauf und Beschaffung"]
["Wirtschaftsingenieurwesen","Projektleiter/_Projektmanager","WirtschaftsingenieurwesenProjektleiter/_Projektmanager","Engineering"]
["Wirtschaftsingenieurwesen","Projektleiter/_Projektmanager","WirtschaftsingenieurwesenProjektleiter/_Projektmanager","Entwicklung"]
["Wirtschaftsingenieurwesen","Projektleiter/_Projektmanager","WirtschaftsingenieurwesenProjektleiter/_Projektmanager","Facility Management"]
["Wirtschaftsingenieurwesen","Projektleiter/_Projektmanager","WirtschaftsingenieurwesenProjektleiter/_Projektmanager","Finanzwesen"]
["Wirtschaftsingenieurwesen","Projektleiter/_Projektmanager","WirtschaftsingenieurwesenProjektleiter/_Projektmanager","Forschung und Entwicklung"]
["Wirtschaftsingenieurwesen","Projektleiter/_Projektmanager","WirtschaftsingenieurwesenProjektleiter/_Projektmanager","Gesundheitsmanagement"]
["Wirtschaftsingenieurwesen","Projektleiter/_Projektmanager","WirtschaftsingenieurwesenProjektleiter/_Projektmanager","IT"]
["Wirtschaftsingenieurwesen","Projektleiter/_Projektmanager","WirtschaftsingenieurwesenProjektleiter/_Projektmanager","IT-Consulting"]
["Wirtschaftsingenieurwesen","Projektleiter/_Projektmanager","WirtschaftsingenieurwesenProjektleiter/_Projektmanager","Konstruktion"]
["Wirtschaftsingenieurwesen","Projektleiter/_Projektmanager","WirtschaftsingenieurwesenProjektleiter/_Projektmanager","Logistik"]
["Wirtschaftsingenieurwesen","Projektleiter/_Projektmanager","WirtschaftsingenieurwesenProjektleiter/_Projektmanager","Marketing"]
["Wirtschaftsingenieurwesen","Projektleiter/_Projektmanager","WirtschaftsingenieurwesenProjektleiter/_Projektmanager","Marktforschung"]
["Wirtschaftsingenieurwesen","Projektleiter/_Projektmanager","WirtschaftsingenieurwesenProjektleiter/_Projektmanager","Mediengestaltung"]
["Wirtschaftsingenieurwesen","Projektleiter/_Projektmanager","WirtschaftsingenieurwesenProjektleiter/_Projektmanager","Online-Marketing"]
["Wirtschaftsingenieurwesen","Projektleiter/_Projektmanager","WirtschaftsingenieurwesenProjektleiter/_Projektmanager","Personalwesen"]
["Wirtschaftsingenieurwesen","Projektleiter/_Projektmanager","WirtschaftsingenieurwesenProjektleiter/_Projektmanager","Planung"]
["Wirtschaftsingenieurwesen","Projektleiter/_Projektmanager","WirtschaftsingenieurwesenProjektleiter/_Projektmanager","Produktion und Fertigung"]
["Wirtschaftsingenieurwesen","Projektleiter/_Projektmanager","WirtschaftsingenieurwesenProjektleiter/_Projektmanager","Projektmanagement"]
["Wirtschaftsingenieurwesen","Projektleiter/_Projektmanager","WirtschaftsingenieurwesenProjektleiter/_Projektmanager","Public Relation und Unternehmenskommunikation"]
["Wirtschaftsingenieurwesen","Projektleiter/_Projektmanager","WirtschaftsingenieurwesenProjektleiter/_Projektmanager","Qualitätswesen"]
["Wirtschaftsingenieurwesen","Projektleiter/_Projektmanager","WirtschaftsingenieurwesenProjektleiter/_Projektmanager","Rechnungswesen"]
["Wirtschaftsingenieurwesen","Projektleiter/_Projektmanager",{"$f":"A1285&B1285&E1285","v":"WirtschaftsingenieurwesenProjektleiter/_Projektmanager"},"Risikomanagement"]
["Wirtschaftsingenieurwesen","Projektleiter/_Projektmanager","WirtschaftsingenieurwesenProjektleiter/_Projektmanager","Softwareentwicklung"]
["Wirtschaftsingenieurwesen","Projektleiter/_Projektmanager","WirtschaftsingenieurwesenProjektleiter/_Projektmanager","Unternehmenskommunikation und Public Relation"]
["Wirtschaftsingenieurwesen","Projektleiter/_Projektmanager","WirtschaftsingenieurwesenProjektleiter/_Projektmanager","Vertrieb-Innendienst"]
["Wirtschaftsingenieurwesen","Projektleiter/_Projektmanager","WirtschaftsingenieurwesenProjektleiter/_Projektmanager","Vertriebssteuerung"]
["Wirtschaftsingenieurwesen","Projektmitarbeiter","WirtschaftsingenieurwesenProjektmitarbeiter","Account Management"]
["Wirtschaftsingenieurwesen","Projektmitarbeiter","WirtschaftsingenieurwesenProjektmitarbeiter","Allgemeine Verwaltung"]
["Wirtschaftsingenieurwesen","Projektmitarbeiter","WirtschaftsingenieurwesenProjektmitarbeiter","Asset Management"]
["Wirtschaftsingenieurwesen","Projektmitarbeiter","WirtschaftsingenieurwesenProjektmitarbeiter","Assistenz der Geschäftsleitung/ des Vorstands"]
["Wirtschaftsingenieurwesen","Projektmitarbeiter","WirtschaftsingenieurwesenProjektmitarbeiter","Aus- und Weiterbildung"]
["Wirtschaftsingenieurwesen","Projektmitarbeiter","WirtschaftsingenieurwesenProjektmitarbeiter","Bauleitung"]
["Wirtschaftsingenieurwesen","Projektmitarbeiter","WirtschaftsingenieurwesenProjektmitarbeiter","Business Development"]
["Wirtschaftsingenieurwesen","Projektmitarbeiter","WirtschaftsingenieurwesenProjektmitarbeiter","Consulting"]
["Wirtschaftsingenieurwesen","Projektmitarbeiter","WirtschaftsingenieurwesenProjektmitarbeiter","Content Management"]
["Wirtschaftsingenieurwesen","Projektmitarbeiter","WirtschaftsingenieurwesenProjektmitarbeiter","Controlling"]
["Wirtschaftsingenieurwesen","Projektmitarbeiter","WirtschaftsingenieurwesenProjektmitarbeiter","Design und Gestaltung"]
["Wirtschaftsingenieurwesen","Projektmitarbeiter","WirtschaftsingenieurwesenProjektmitarbeiter","Einkauf und Beschaffung"]
["Wirtschaftsingenieurwesen","Projektmitarbeiter","WirtschaftsingenieurwesenProjektmitarbeiter","Engineering"]
["Wirtschaftsingenieurwesen","Projektmitarbeiter","WirtschaftsingenieurwesenProjektmitarbeiter","Entwicklung"]
["Wirtschaftsingenieurwesen","Projektmitarbeiter","WirtschaftsingenieurwesenProjektmitarbeiter","Event Management"]
["Wirtschaftsingenieurwesen","Projektmitarbeiter","WirtschaftsingenieurwesenProjektmitarbeiter","Facility Management"]
["Wirtschaftsingenieurwesen","Projektmitarbeiter","WirtschaftsingenieurwesenProjektmitarbeiter","Finanzwesen"]
["Wirtschaftsingenieurwesen","Projektmitarbeiter","WirtschaftsingenieurwesenProjektmitarbeiter","Forschung und Entwicklung"]
["Wirtschaftsingenieurwesen","Projektmitarbeiter","WirtschaftsingenieurwesenProjektmitarbeiter","Gesundheitsmanagement"]
["Wirtschaftsingenieurwesen","Projektmitarbeiter","WirtschaftsingenieurwesenProjektmitarbeiter","IT"]
["Wirtschaftsingenieurwesen","Projektmitarbeiter","WirtschaftsingenieurwesenProjektmitarbeiter","IT-Consulting"]
["Wirtschaftsingenieurwesen","Projektmitarbeiter","WirtschaftsingenieurwesenProjektmitarbeiter","Key Account Management"]
["Wirtschaftsingenieurwesen","Projektmitarbeiter","WirtschaftsingenieurwesenProjektmitarbeiter","Konstruktion"]
["Wirtschaftsingenieurwesen","Projektmitarbeiter","WirtschaftsingenieurwesenProjektmitarbeiter","Logistik"]
["Wirtschaftsingenieurwesen","Projektmitarbeiter","WirtschaftsingenieurwesenProjektmitarbeiter","Marketing"]
["Wirtschaftsingenieurwesen","Projektmitarbeiter","WirtschaftsingenieurwesenProjektmitarbeiter","Marktforschung"]
["Wirtschaftsingenieurwesen","Projektmitarbeiter","WirtschaftsingenieurwesenProjektmitarbeiter","Mediengestaltung"]
["Wirtschaftsingenieurwesen","Projektmitarbeiter","WirtschaftsingenieurwesenProjektmitarbeiter","Online-Marketing"]
["Wirtschaftsingenieurwesen","Projektmitarbeiter","WirtschaftsingenieurwesenProjektmitarbeiter","Personalwesen"]
["Wirtschaftsingenieurwesen","Projektmitarbeiter","WirtschaftsingenieurwesenProjektmitarbeiter","Planung"]
["Wirtschaftsingenieurwesen","Projektmitarbeiter","WirtschaftsingenieurwesenProjektmitarbeiter","Portfoliomanagement"]
["Wirtschaftsingenieurwesen","Projektmitarbeiter","WirtschaftsingenieurwesenProjektmitarbeiter","Produktion und Fertigung"]
["Wirtschaftsingenieurwesen","Projektmitarbeiter","WirtschaftsingenieurwesenProjektmitarbeiter","Produktmanagement"]
["Wirtschaftsingenieurwesen","Projektmitarbeiter","WirtschaftsingenieurwesenProjektmitarbeiter","Projektmanagement"]
["Wirtschaftsingenieurwesen","Projektmitarbeiter","WirtschaftsingenieurwesenProjektmitarbeiter","Prozessmanagement"]
["Wirtschaftsingenieurwesen","Projektmitarbeiter","WirtschaftsingenieurwesenProjektmitarbeiter","Public Relation und Unternehmenskommunikation"]
["Wirtschaftsingenieurwesen","Projektmitarbeiter","WirtschaftsingenieurwesenProjektmitarbeiter","Qualitätswesen"]
["Wirtschaftsingenieurwesen","Projektmitarbeiter","WirtschaftsingenieurwesenProjektmitarbeiter","Rechnungswesen"]
["Wirtschaftsingenieurwesen","Projektmitarbeiter","WirtschaftsingenieurwesenProjektmitarbeiter","Redaktion"]
["Wirtschaftsingenieurwesen","Projektmitarbeiter","WirtschaftsingenieurwesenProjektmitarbeiter","Risikomanagement"]
["Wirtschaftsingenieurwesen","Projektmitarbeiter","WirtschaftsingenieurwesenProjektmitarbeiter","Softwareentwicklung"]
["Wirtschaftsingenieurwesen","Projektmitarbeiter","WirtschaftsingenieurwesenProjektmitarbeiter","Steuer- und Wirtschaftsprüfung"]
["Wirtschaftsingenieurwesen","Projektmitarbeiter","WirtschaftsingenieurwesenProjektmitarbeiter","Strategieentwicklung"]
["Wirtschaftsingenieurwesen","Projektmitarbeiter","WirtschaftsingenieurwesenProjektmitarbeiter","Strategisches Produktmanagement"]
["Wirtschaftsingenieurwesen","Projektmitarbeiter","WirtschaftsingenieurwesenProjektmitarbeiter","Unternehmenskommunikation und Public Relation"]
["Wirtschaftsingenieurwesen","Projektmitarbeiter","WirtschaftsingenieurwesenProjektmitarbeiter","Vertrieb-Außendienst"]
["Wirtschaftsingenieurwesen","Projektmitarbeiter","WirtschaftsingenieurwesenProjektmitarbeiter","Vertrieb-Innendienst"]
["Wirtschaftsingenieurwesen","Projektmitarbeiter","WirtschaftsingenieurwesenProjektmitarbeiter","Vertriebssteuerung"]
["Wirtschaftsingenieurwesen","Projektmitarbeiter","WirtschaftsingenieurwesenProjektmitarbeiter","Wirtschafts- und Steuerprüfung"]
["Wirtschaftsingenieurwesen","Prozessmanager","WirtschaftsingenieurwesenProzessmanager","Prozessmanagement"]
["Wirtschaftsingenieurwesen","Prüfungsassistent","WirtschaftsingenieurwesenPrüfungsassistent","Bauleitung"]
["Wirtschaftsingenieurwesen","Prüfungsassistent","WirtschaftsingenieurwesenPrüfungsassistent","Content Management"]
["Wirtschaftsingenieurwesen","Prüfungsassistent","WirtschaftsingenieurwesenPrüfungsassistent","Controlling"]
["Wirtschaftsingenieurwesen","Prüfungsassistent","WirtschaftsingenieurwesenPrüfungsassistent","Einkauf und Beschaffung"]
["Wirtschaftsingenieurwesen","Prüfungsassistent","WirtschaftsingenieurwesenPrüfungsassistent","Engineering"]
["Wirtschaftsingenieurwesen","Prüfungsassistent","WirtschaftsingenieurwesenPrüfungsassistent","Entwicklung"]
["Wirtschaftsingenieurwesen","Prüfungsassistent","WirtschaftsingenieurwesenPrüfungsassistent","Finanzwesen"]
["Wirtschaftsingenieurwesen","Prüfungsassistent","WirtschaftsingenieurwesenPrüfungsassistent","Gesundheitsmanagement"]
["Wirtschaftsingenieurwesen","Prüfungsassistent","WirtschaftsingenieurwesenPrüfungsassistent","Konstruktion"]
["Wirtschaftsingenieurwesen","Prüfungsassistent",{"$f":"A1349&B1349&E1349","v":"WirtschaftsingenieurwesenPrüfungsassistent"},"Logistik"]
["Wirtschaftsingenieurwesen","Prüfungsassistent","WirtschaftsingenieurwesenPrüfungsassistent","Portfoliomanagement"]
["Wirtschaftsingenieurwesen","Prüfungsassistent","WirtschaftsingenieurwesenPrüfungsassistent","Produktion und Fertigung"]
["Wirtschaftsingenieurwesen","Prüfungsassistent","WirtschaftsingenieurwesenPrüfungsassistent","Prozessmanagement"]
["Wirtschaftsingenieurwesen","Prüfungsassistent","WirtschaftsingenieurwesenPrüfungsassistent","Qualitätswesen"]
["Wirtschaftsingenieurwesen","Prüfungsassistent","WirtschaftsingenieurwesenPrüfungsassistent","Rechnungswesen"]
["Wirtschaftsingenieurwesen","Prüfungsassistent","WirtschaftsingenieurwesenPrüfungsassistent","Risikomanagement"]
["Wirtschaftsingenieurwesen","Prüfungsassistent","WirtschaftsingenieurwesenPrüfungsassistent","Steuer- und Wirtschaftsprüfung"]
["Wirtschaftsingenieurwesen","Prüfungsassistent","WirtschaftsingenieurwesenPrüfungsassistent","Wirtschafts- und Steuerprüfung"]
["Wirtschaftsingenieurwesen","Redakteur","WirtschaftsingenieurwesenRedakteur","Redaktion"]
["Wirtschaftsingenieurwesen","Referent","WirtschaftsingenieurwesenReferent","Aus- und Weiterbildung"]
["Wirtschaftsingenieurwesen","Referent","WirtschaftsingenieurwesenReferent","Controlling"]
["Wirtschaftsingenieurwesen","Referent","WirtschaftsingenieurwesenReferent","Event Management"]
["Wirtschaftsingenieurwesen","Referent","WirtschaftsingenieurwesenReferent","Finanzwesen"]
["Wirtschaftsingenieurwesen","Referent","WirtschaftsingenieurwesenReferent","Gesundheitsmanagement"]
["Wirtschaftsingenieurwesen","Referent","WirtschaftsingenieurwesenReferent","Marketing"]
["Wirtschaftsingenieurwesen","Referent","WirtschaftsingenieurwesenReferent","Personalwesen"]
["Wirtschaftsingenieurwesen","Referent","WirtschaftsingenieurwesenReferent","Public Relation und Unternehmenskommunikation"]
["Wirtschaftsingenieurwesen","Referent","WirtschaftsingenieurwesenReferent","Rechnungswesen"]
["Wirtschaftsingenieurwesen","Referent","WirtschaftsingenieurwesenReferent","Unternehmenskommunikation und Public Relation"]
["Wirtschaftsingenieurwesen","Sales_Manager","WirtschaftsingenieurwesenSales_Manager","Vertrieb-Außendienst"]
["Wirtschaftsingenieurwesen","Softwareentwickler","WirtschaftsingenieurwesenSoftwareentwickler","IT"]
["Wirtschaftsingenieurwesen","Softwareentwickler","WirtschaftsingenieurwesenSoftwareentwickler","IT-Consulting"]
["Wirtschaftsingenieurwesen","Softwareentwickler","WirtschaftsingenieurwesenSoftwareentwickler","Projektmanagement"]
["Wirtschaftsingenieurwesen","Softwareentwickler","WirtschaftsingenieurwesenSoftwareentwickler","Softwareentwicklung"]
["Wirtschaftsingenieurwesen","Steuerassistent/_Wirtschaftsprüfungsassistent","WirtschaftsingenieurwesenSteuerassistent/_Wirtschaftsprüfungsassistent","Wirtschafts- und Steuerprüfung"]
["Wirtschaftsingenieurwesen","Steuerassistent/_Wirtschaftsprüfungsassistent","WirtschaftsingenieurwesenSteuerassistent/_Wirtschaftsprüfungsassistent","Steuer- und Wirtschaftsprüfung"]
["Wirtschaftsingenieurwesen","Strategie_Consultant","WirtschaftsingenieurwesenStrategie_Consultant","Consulting"]
["Wirtschaftsingenieurwesen","Strategie_Consultant","WirtschaftsingenieurwesenStrategie_Consultant","Strategieentwicklung"]
["Wirtschaftsingenieurwesen","Technischer_Angestellter","WirtschaftsingenieurwesenTechnischer_Angestellter","Bauleitung"]
["Wirtschaftsingenieurwesen","Technischer_Angestellter","WirtschaftsingenieurwesenTechnischer_Angestellter","Engineering"]
["Wirtschaftsingenieurwesen","Technischer_Angestellter","WirtschaftsingenieurwesenTechnischer_Angestellter","Entwicklung"]
["Wirtschaftsingenieurwesen","Technischer_Angestellter","WirtschaftsingenieurwesenTechnischer_Angestellter","Facility Management"]
["Wirtschaftsingenieurwesen","Technischer_Angestellter","WirtschaftsingenieurwesenTechnischer_Angestellter","Forschung und Entwicklung"]
["Wirtschaftsingenieurwesen","Technischer_Angestellter","WirtschaftsingenieurwesenTechnischer_Angestellter","IT"]
["Wirtschaftsingenieurwesen","Technischer_Angestellter","WirtschaftsingenieurwesenTechnischer_Angestellter","Konstruktion"]
["Wirtschaftsingenieurwesen","Technischer_Angestellter","WirtschaftsingenieurwesenTechnischer_Angestellter","Mediengestaltung"]
["Wirtschaftsingenieurwesen","Technischer_Angestellter","WirtschaftsingenieurwesenTechnischer_Angestellter","Planung"]
["Wirtschaftsingenieurwesen","Technischer_Angestellter","WirtschaftsingenieurwesenTechnischer_Angestellter","Produktion und Fertigung"]
["Wirtschaftsingenieurwesen","Technischer_Angestellter","WirtschaftsingenieurwesenTechnischer_Angestellter","Projektmanagement"]
["Wirtschaftsingenieurwesen","Technischer_Angestellter","WirtschaftsingenieurwesenTechnischer_Angestellter","Prozessmanagement"]
["Wirtschaftsingenieurwesen","Trainee","WirtschaftsingenieurwesenTrainee","Account Management"]
["Wirtschaftsingenieurwesen","Trainee","WirtschaftsingenieurwesenTrainee","Asset Management"]
["Wirtschaftsingenieurwesen","Trainee","WirtschaftsingenieurwesenTrainee","Assistenz der Geschäftsleitung/ des Vorstands"]
["Wirtschaftsingenieurwesen","Trainee","WirtschaftsingenieurwesenTrainee","Bauleitung"]
["Wirtschaftsingenieurwesen","Trainee","WirtschaftsingenieurwesenTrainee","Business Development"]
["Wirtschaftsingenieurwesen","Trainee","WirtschaftsingenieurwesenTrainee","Consulting"]
["Wirtschaftsingenieurwesen","Trainee","WirtschaftsingenieurwesenTrainee","Content Management"]
["Wirtschaftsingenieurwesen","Trainee","WirtschaftsingenieurwesenTrainee","Controlling"]
["Wirtschaftsingenieurwesen","Trainee","WirtschaftsingenieurwesenTrainee","Design und Gestaltung"]
["Wirtschaftsingenieurwesen","Trainee","WirtschaftsingenieurwesenTrainee","Einkauf und Beschaffung"]
["Wirtschaftsingenieurwesen","Trainee","WirtschaftsingenieurwesenTrainee","Engineering"]
["Wirtschaftsingenieurwesen","Trainee","WirtschaftsingenieurwesenTrainee","Entwicklung"]
["Wirtschaftsingenieurwesen","Trainee","WirtschaftsingenieurwesenTrainee","Event Management"]
["Wirtschaftsingenieurwesen","Trainee","WirtschaftsingenieurwesenTrainee","Facility Management"]
["Wirtschaftsingenieurwesen","Trainee","WirtschaftsingenieurwesenTrainee","Finanzwesen"]
["Wirtschaftsingenieurwesen","Trainee","WirtschaftsingenieurwesenTrainee","Forschung und Entwicklung"]
["Wirtschaftsingenieurwesen","Trainee","WirtschaftsingenieurwesenTrainee","Gesundheitsmanagement"]
["Wirtschaftsingenieurwesen","Trainee","WirtschaftsingenieurwesenTrainee","IT"]
["Wirtschaftsingenieurwesen","Trainee","WirtschaftsingenieurwesenTrainee","IT-Consulting"]
["Wirtschaftsingenieurwesen","Trainee","WirtschaftsingenieurwesenTrainee","Key Account Management"]
["Wirtschaftsingenieurwesen","Trainee","WirtschaftsingenieurwesenTrainee","Konstruktion"]
["Wirtschaftsingenieurwesen","Trainee","WirtschaftsingenieurwesenTrainee","Logistik"]
["Wirtschaftsingenieurwesen","Trainee","WirtschaftsingenieurwesenTrainee","Marketing"]
["Wirtschaftsingenieurwesen","Trainee",{"$f":"A1413&B1413&E1413","v":"WirtschaftsingenieurwesenTrainee"},"Marktforschung"]
["Wirtschaftsingenieurwesen","Trainee","WirtschaftsingenieurwesenTrainee","Online-Marketing"]
["Wirtschaftsingenieurwesen","Trainee","WirtschaftsingenieurwesenTrainee","Personalwesen"]
["Wirtschaftsingenieurwesen","Trainee","WirtschaftsingenieurwesenTrainee","Portfoliomanagement"]
["Wirtschaftsingenieurwesen","Trainee","WirtschaftsingenieurwesenTrainee","Produktion und Fertigung"]
["Wirtschaftsingenieurwesen","Trainee","WirtschaftsingenieurwesenTrainee","Produktmanagement"]
["Wirtschaftsingenieurwesen","Trainee","WirtschaftsingenieurwesenTrainee","Projektmanagement"]
["Wirtschaftsingenieurwesen","Trainee","WirtschaftsingenieurwesenTrainee","Prozessmanagement"]
["Wirtschaftsingenieurwesen","Trainee","WirtschaftsingenieurwesenTrainee","Public Relation und Unternehmenskommunikation"]
["Wirtschaftsingenieurwesen","Trainee","WirtschaftsingenieurwesenTrainee","Qualitätswesen"]
["Wirtschaftsingenieurwesen","Trainee","WirtschaftsingenieurwesenTrainee","Rechnungswesen"]
["Wirtschaftsingenieurwesen","Trainee","WirtschaftsingenieurwesenTrainee","Redaktion"]
["Wirtschaftsingenieurwesen","Trainee","WirtschaftsingenieurwesenTrainee","Risikomanagement"]
["Wirtschaftsingenieurwesen","Trainee","WirtschaftsingenieurwesenTrainee","Softwareentwicklung"]
["Wirtschaftsingenieurwesen","Trainee","WirtschaftsingenieurwesenTrainee","Strategieentwicklung"]
["Wirtschaftsingenieurwesen","Trainee","WirtschaftsingenieurwesenTrainee","Strategisches Produktmanagement"]
["Wirtschaftsingenieurwesen","Trainee","WirtschaftsingenieurwesenTrainee","Unternehmenskommunikation und Public Relation"]
["Wirtschaftsingenieurwesen","Trainee","WirtschaftsingenieurwesenTrainee","Vertrieb-Außendienst"]
["Wirtschaftsingenieurwesen","Trainee","WirtschaftsingenieurwesenTrainee","Vertrieb-Innendienst"]
["Wirtschaftsingenieurwesen","Trainee","WirtschaftsingenieurwesenTrainee","Vertriebssteuerung"]
["Wirtschaftsingenieurwesen","Trainee_Filialleiter/_Verkaufsleiter","WirtschaftsingenieurwesenTrainee_Filialleiter/_Verkaufsleiter","Vertrieb-Außendienst"]
["Wirtschaftsingenieurwesen","Vertriebler","WirtschaftsingenieurwesenVertriebler","Vertrieb-Außendienst"]
["Wirtschaftsingenieurwesen","Vertriebler","WirtschaftsingenieurwesenVertriebler","Key Account Management"]
["Wirtschaftsingenieurwesen","Vertriebler","WirtschaftsingenieurwesenVertriebler","Account Management"]
["Wirtschaftsingenieurwesen","Wirtschaftsprüfungsassistent/_Steuerassistent","WirtschaftsingenieurwesenWirtschaftsprüfungsassistent/_Steuerassistent","Wirtschafts- und Steuerprüfung"]
["Wirtschaftsingenieurwesen","Wirtschaftsprüfungsassistent/_Steuerassistent","WirtschaftsingenieurwesenWirtschaftsprüfungsassistent/_Steuerassistent","Steuer- und Wirtschaftsprüfung"]
["Wirtschaftsingenieurwesen","Wissenschaftlicher_Mitarbeiter","WirtschaftsingenieurwesenWissenschaftlicher_Mitarbeiter","Forschung und Entwicklung"]
["Wirtschaftsingenieurwesen","Wissenschaftlicher_Mitarbeiter","WirtschaftsingenieurwesenWissenschaftlicher_Mitarbeiter","Marktforschung"]
["Wirtschaftswissenschaften","Account_Manager","WirtschaftswissenschaftenAccount_Manager","Account Management"]
["Wirtschaftswissenschaften","Analyst","WirtschaftswissenschaftenAnalyst","Asset Management"]
["Wirtschaftswissenschaften","Analyst","WirtschaftswissenschaftenAnalyst","Business Development"]
["Wirtschaftswissenschaften","Analyst","WirtschaftswissenschaftenAnalyst","Controlling"]
["Wirtschaftswissenschaften","Analyst","WirtschaftswissenschaftenAnalyst","Finanzwesen"]
["Wirtschaftswissenschaften","Analyst","WirtschaftswissenschaftenAnalyst","Strategieentwicklung"]
["Wirtschaftswissenschaften","Asset_Manager","WirtschaftswissenschaftenAsset_Manager","Asset Management"]
["Wirtschaftswissenschaften","Assistent_der_Geschäftsleitung/_des_Vorstands","WirtschaftswissenschaftenAssistent_der_Geschäftsleitung/_des_Vorstands","Assistenz der Geschäftsleitung/ des Vorstands"]
["Wirtschaftswissenschaften","Associate","WirtschaftswissenschaftenAssociate","Consulting"]
["Wirtschaftswissenschaften","Associate","WirtschaftswissenschaftenAssociate","Finanzwesen"]
["Wirtschaftswissenschaften","Associate","WirtschaftswissenschaftenAssociate","Strategieentwicklung"]
["Wirtschaftswissenschaften","Business_Development_Manager","WirtschaftswissenschaftenBusiness_Development_Manager","Business Development"]
["Wirtschaftswissenschaften","Consultant","WirtschaftswissenschaftenConsultant","Business Development"]
["Wirtschaftswissenschaften","Consultant","WirtschaftswissenschaftenConsultant","Consulting"]
["Wirtschaftswissenschaften","Consultant","WirtschaftswissenschaftenConsultant","Finanzwesen"]
["Wirtschaftswissenschaften","Consultant","WirtschaftswissenschaftenConsultant","Strategieentwicklung"]
["Wirtschaftswissenschaften","Content_Manager","WirtschaftswissenschaftenContent_Manager","Content Management"]
["Wirtschaftswissenschaften","Controller","WirtschaftswissenschaftenController","Controlling"]
["Wirtschaftswissenschaften","Controller","WirtschaftswissenschaftenController","Einkauf und Beschaffung"]
["Wirtschaftswissenschaften","Controller","WirtschaftswissenschaftenController","Finanzwesen"]
["Wirtschaftswissenschaften","Controller","WirtschaftswissenschaftenController","Rechnungswesen"]
["Wirtschaftswissenschaften","Controller","WirtschaftswissenschaftenController","Risikomanagement"]
["Wirtschaftswissenschaften","Controller","WirtschaftswissenschaftenController","Vertriebssteuerung"]
["Wirtschaftswissenschaften","Einkäufer","WirtschaftswissenschaftenEinkäufer","Einkauf und Beschaffung"]
["Wirtschaftswissenschaften","Einkäufer","WirtschaftswissenschaftenEinkäufer","Produktmanagement"]
["Wirtschaftswissenschaften","Event_Manager","WirtschaftswissenschaftenEvent_Manager","Event Management"]
["Wirtschaftswissenschaften","Kaufmännischer_Angestellter","WirtschaftswissenschaftenKaufmännischer_Angestellter","Account Management"]
["Wirtschaftswissenschaften","Kaufmännischer_Angestellter","WirtschaftswissenschaftenKaufmännischer_Angestellter","Allgemeine Verwaltung"]
["Wirtschaftswissenschaften","Kaufmännischer_Angestellter","WirtschaftswissenschaftenKaufmännischer_Angestellter","Asset Management"]
["Wirtschaftswissenschaften","Kaufmännischer_Angestellter","WirtschaftswissenschaftenKaufmännischer_Angestellter","Assistenz der Geschäftsleitung/ des Vorstands"]
["Wirtschaftswissenschaften","Kaufmännischer_Angestellter","WirtschaftswissenschaftenKaufmännischer_Angestellter","Aus- und Weiterbildung"]
["Wirtschaftswissenschaften","Kaufmännischer_Angestellter","WirtschaftswissenschaftenKaufmännischer_Angestellter","Business Development"]
["Wirtschaftswissenschaften","Kaufmännischer_Angestellter","WirtschaftswissenschaftenKaufmännischer_Angestellter","Consulting"]
["Wirtschaftswissenschaften","Kaufmännischer_Angestellter","WirtschaftswissenschaftenKaufmännischer_Angestellter","Content Management"]
["Wirtschaftswissenschaften","Kaufmännischer_Angestellter","WirtschaftswissenschaftenKaufmännischer_Angestellter","Controlling"]
["Wirtschaftswissenschaften","Kaufmännischer_Angestellter","WirtschaftswissenschaftenKaufmännischer_Angestellter","Einkauf und Beschaffung"]
["Wirtschaftswissenschaften","Kaufmännischer_Angestellter",{"$f":"A1477&B1477&E1477","v":"WirtschaftswissenschaftenKaufmännischer_Angestellter"},"Event Management"]
["Wirtschaftswissenschaften","Kaufmännischer_Angestellter","WirtschaftswissenschaftenKaufmännischer_Angestellter","Facility Management"]
["Wirtschaftswissenschaften","Kaufmännischer_Angestellter","WirtschaftswissenschaftenKaufmännischer_Angestellter","Finanzwesen"]
["Wirtschaftswissenschaften","Kaufmännischer_Angestellter","WirtschaftswissenschaftenKaufmännischer_Angestellter","Forschung und Entwicklung"]
["Wirtschaftswissenschaften","Kaufmännischer_Angestellter","WirtschaftswissenschaftenKaufmännischer_Angestellter","Gesundheitsmanagement"]
["Wirtschaftswissenschaften","Kaufmännischer_Angestellter","WirtschaftswissenschaftenKaufmännischer_Angestellter","Key Account Management"]
["Wirtschaftswissenschaften","Kaufmännischer_Angestellter","WirtschaftswissenschaftenKaufmännischer_Angestellter","Logistik"]
["Wirtschaftswissenschaften","Kaufmännischer_Angestellter","WirtschaftswissenschaftenKaufmännischer_Angestellter","Marketing"]
["Wirtschaftswissenschaften","Kaufmännischer_Angestellter","WirtschaftswissenschaftenKaufmännischer_Angestellter","Marktforschung"]
["Wirtschaftswissenschaften","Kaufmännischer_Angestellter","WirtschaftswissenschaftenKaufmännischer_Angestellter","Mediengestaltung"]
["Wirtschaftswissenschaften","Kaufmännischer_Angestellter","WirtschaftswissenschaftenKaufmännischer_Angestellter","Online-Marketing"]
["Wirtschaftswissenschaften","Kaufmännischer_Angestellter","WirtschaftswissenschaftenKaufmännischer_Angestellter","Personalwesen"]
["Wirtschaftswissenschaften","Kaufmännischer_Angestellter","WirtschaftswissenschaftenKaufmännischer_Angestellter","Planung"]
["Wirtschaftswissenschaften","Kaufmännischer_Angestellter","WirtschaftswissenschaftenKaufmännischer_Angestellter","Portfoliomanagement"]
["Wirtschaftswissenschaften","Kaufmännischer_Angestellter","WirtschaftswissenschaftenKaufmännischer_Angestellter","Produktmanagement"]
["Wirtschaftswissenschaften","Kaufmännischer_Angestellter","WirtschaftswissenschaftenKaufmännischer_Angestellter","Projektmanagement"]
["Wirtschaftswissenschaften","Kaufmännischer_Angestellter","WirtschaftswissenschaftenKaufmännischer_Angestellter","Prozessmanagement"]
["Wirtschaftswissenschaften","Kaufmännischer_Angestellter","WirtschaftswissenschaftenKaufmännischer_Angestellter","Public Relation und Unternehmenskommunikation"]
["Wirtschaftswissenschaften","Kaufmännischer_Angestellter","WirtschaftswissenschaftenKaufmännischer_Angestellter","Qualitätswesen"]
["Wirtschaftswissenschaften","Kaufmännischer_Angestellter","WirtschaftswissenschaftenKaufmännischer_Angestellter","Rechnungswesen"]
["Wirtschaftswissenschaften","Kaufmännischer_Angestellter","WirtschaftswissenschaftenKaufmännischer_Angestellter","Redaktion"]
["Wirtschaftswissenschaften","Kaufmännischer_Angestellter","WirtschaftswissenschaftenKaufmännischer_Angestellter","Risikomanagement"]
["Wirtschaftswissenschaften","Kaufmännischer_Angestellter","WirtschaftswissenschaftenKaufmännischer_Angestellter","Sozialwesen"]
["Wirtschaftswissenschaften","Kaufmännischer_Angestellter","WirtschaftswissenschaftenKaufmännischer_Angestellter","Steuer- und Wirtschaftsprüfung"]
["Wirtschaftswissenschaften","Kaufmännischer_Angestellter","WirtschaftswissenschaftenKaufmännischer_Angestellter","Strategieentwicklung"]
["Wirtschaftswissenschaften","Kaufmännischer_Angestellter","WirtschaftswissenschaftenKaufmännischer_Angestellter","Strategisches Produktmanagement"]
["Wirtschaftswissenschaften","Kaufmännischer_Angestellter","WirtschaftswissenschaftenKaufmännischer_Angestellter","Unternehmenskommunikation und Public Relation"]
["Wirtschaftswissenschaften","Kaufmännischer_Angestellter","WirtschaftswissenschaftenKaufmännischer_Angestellter","Vertrieb-Außendienst"]
["Wirtschaftswissenschaften","Kaufmännischer_Angestellter","WirtschaftswissenschaftenKaufmännischer_Angestellter","Vertrieb-Innendienst"]
["Wirtschaftswissenschaften","Kaufmännischer_Angestellter","WirtschaftswissenschaftenKaufmännischer_Angestellter","Vertriebssteuerung"]
["Wirtschaftswissenschaften","Kaufmännischer_Angestellter","WirtschaftswissenschaftenKaufmännischer_Angestellter","Wirtschafts- und Steuerprüfung"]
["Wirtschaftswissenschaften","Key_Account_Manager","WirtschaftswissenschaftenKey_Account_Manager","Key Account Management"]
["Wirtschaftswissenschaften","Marketing_Assistent","WirtschaftswissenschaftenMarketing_Assistent","Marketing"]
["Wirtschaftswissenschaften","Marketing_Assistent","WirtschaftswissenschaftenMarketing_Assistent","Online-Marketing"]
["Wirtschaftswissenschaften","Mitarbeiter","WirtschaftswissenschaftenMitarbeiter","Account Management"]
["Wirtschaftswissenschaften","Mitarbeiter","WirtschaftswissenschaftenMitarbeiter","Allgemeine Verwaltung"]
["Wirtschaftswissenschaften","Mitarbeiter","WirtschaftswissenschaftenMitarbeiter","Asset Management"]
["Wirtschaftswissenschaften","Mitarbeiter","WirtschaftswissenschaftenMitarbeiter","Assistenz der Geschäftsleitung/ des Vorstands"]
["Wirtschaftswissenschaften","Mitarbeiter","WirtschaftswissenschaftenMitarbeiter","Aus- und Weiterbildung"]
["Wirtschaftswissenschaften","Mitarbeiter","WirtschaftswissenschaftenMitarbeiter","Business Development"]
["Wirtschaftswissenschaften","Mitarbeiter","WirtschaftswissenschaftenMitarbeiter","Consulting"]
["Wirtschaftswissenschaften","Mitarbeiter","WirtschaftswissenschaftenMitarbeiter","Content Management"]
["Wirtschaftswissenschaften","Mitarbeiter","WirtschaftswissenschaftenMitarbeiter","Controlling"]
["Wirtschaftswissenschaften","Mitarbeiter","WirtschaftswissenschaftenMitarbeiter","Einkauf und Beschaffung"]
["Wirtschaftswissenschaften","Mitarbeiter","WirtschaftswissenschaftenMitarbeiter","Event Management"]
["Wirtschaftswissenschaften","Mitarbeiter","WirtschaftswissenschaftenMitarbeiter","Facility Management"]
["Wirtschaftswissenschaften","Mitarbeiter","WirtschaftswissenschaftenMitarbeiter","Finanzwesen"]
["Wirtschaftswissenschaften","Mitarbeiter","WirtschaftswissenschaftenMitarbeiter","Forschung und Entwicklung"]
["Wirtschaftswissenschaften","Mitarbeiter","WirtschaftswissenschaftenMitarbeiter","Gesundheitsmanagement"]
["Wirtschaftswissenschaften","Mitarbeiter","WirtschaftswissenschaftenMitarbeiter","Key Account Management"]
["Wirtschaftswissenschaften","Mitarbeiter","WirtschaftswissenschaftenMitarbeiter","Logistik"]
["Wirtschaftswissenschaften","Mitarbeiter","WirtschaftswissenschaftenMitarbeiter","Marketing"]
["Wirtschaftswissenschaften","Mitarbeiter","WirtschaftswissenschaftenMitarbeiter","Marktforschung"]
["Wirtschaftswissenschaften","Mitarbeiter","WirtschaftswissenschaftenMitarbeiter","Mediengestaltung"]
["Wirtschaftswissenschaften","Mitarbeiter","WirtschaftswissenschaftenMitarbeiter","Online-Marketing"]
["Wirtschaftswissenschaften","Mitarbeiter","WirtschaftswissenschaftenMitarbeiter","Personalwesen"]
["Wirtschaftswissenschaften","Mitarbeiter","WirtschaftswissenschaftenMitarbeiter","Planung"]
["Wirtschaftswissenschaften","Mitarbeiter","WirtschaftswissenschaftenMitarbeiter","Portfoliomanagement"]
["Wirtschaftswissenschaften","Mitarbeiter","WirtschaftswissenschaftenMitarbeiter","Produktmanagement"]
["Wirtschaftswissenschaften","Mitarbeiter","WirtschaftswissenschaftenMitarbeiter","Projektmanagement"]
["Wirtschaftswissenschaften","Mitarbeiter","WirtschaftswissenschaftenMitarbeiter","Prozessmanagement"]
["Wirtschaftswissenschaften","Mitarbeiter","WirtschaftswissenschaftenMitarbeiter","Public Relation und Unternehmenskommunikation"]
["Wirtschaftswissenschaften","Mitarbeiter","WirtschaftswissenschaftenMitarbeiter","Qualitätswesen"]
["Wirtschaftswissenschaften","Mitarbeiter","WirtschaftswissenschaftenMitarbeiter","Rechnungswesen"]
["Wirtschaftswissenschaften","Mitarbeiter",{"$f":"A1541&B1541&E1541","v":"WirtschaftswissenschaftenMitarbeiter"},"Redaktion"]
["Wirtschaftswissenschaften","Mitarbeiter","WirtschaftswissenschaftenMitarbeiter","Risikomanagement"]
["Wirtschaftswissenschaften","Mitarbeiter","WirtschaftswissenschaftenMitarbeiter","Sozialwesen"]
["Wirtschaftswissenschaften","Mitarbeiter","WirtschaftswissenschaftenMitarbeiter","Steuer- und Wirtschaftsprüfung"]
["Wirtschaftswissenschaften","Mitarbeiter","WirtschaftswissenschaftenMitarbeiter","Strategieentwicklung"]
["Wirtschaftswissenschaften","Mitarbeiter","WirtschaftswissenschaftenMitarbeiter","Strategisches Produktmanagement"]
["Wirtschaftswissenschaften","Mitarbeiter","WirtschaftswissenschaftenMitarbeiter","Unternehmenskommunikation und Public Relation"]
["Wirtschaftswissenschaften","Mitarbeiter","WirtschaftswissenschaftenMitarbeiter","Vertrieb-Außendienst"]
["Wirtschaftswissenschaften","Mitarbeiter","WirtschaftswissenschaftenMitarbeiter","Vertrieb-Innendienst"]
["Wirtschaftswissenschaften","Mitarbeiter","WirtschaftswissenschaftenMitarbeiter","Vertriebssteuerung"]
["Wirtschaftswissenschaften","Mitarbeiter","WirtschaftswissenschaftenMitarbeiter","Wirtschafts- und Steuerprüfung"]
["Wirtschaftswissenschaften","Personalreferent","WirtschaftswissenschaftenPersonalreferent","Personalwesen"]
["Wirtschaftswissenschaften","Portfoliomanager","WirtschaftswissenschaftenPortfoliomanager","Portfoliomanagement"]
["Wirtschaftswissenschaften","Produkt_Manager","WirtschaftswissenschaftenProdukt_Manager","Einkauf und Beschaffung"]
["Wirtschaftswissenschaften","Produkt_Manager","WirtschaftswissenschaftenProdukt_Manager","Produktmanagement"]
["Wirtschaftswissenschaften","Produkt_Manager","WirtschaftswissenschaftenProdukt_Manager","Strategisches Produktmanagement"]
["Wirtschaftswissenschaften","Projektleiter/_Projektmanager","WirtschaftswissenschaftenProjektleiter/_Projektmanager","Aus- und Weiterbildung"]
["Wirtschaftswissenschaften","Projektleiter/_Projektmanager","WirtschaftswissenschaftenProjektleiter/_Projektmanager","Controlling"]
["Wirtschaftswissenschaften","Projektleiter/_Projektmanager","WirtschaftswissenschaftenProjektleiter/_Projektmanager","Einkauf und Beschaffung"]
["Wirtschaftswissenschaften","Projektleiter/_Projektmanager","WirtschaftswissenschaftenProjektleiter/_Projektmanager","Facility Management"]
["Wirtschaftswissenschaften","Projektleiter/_Projektmanager","WirtschaftswissenschaftenProjektleiter/_Projektmanager","Finanzwesen"]
["Wirtschaftswissenschaften","Projektleiter/_Projektmanager","WirtschaftswissenschaftenProjektleiter/_Projektmanager","Forschung und Entwicklung"]
["Wirtschaftswissenschaften","Projektleiter/_Projektmanager","WirtschaftswissenschaftenProjektleiter/_Projektmanager","Gesundheitsmanagement"]
["Wirtschaftswissenschaften","Projektleiter/_Projektmanager","WirtschaftswissenschaftenProjektleiter/_Projektmanager","Logistik"]
["Wirtschaftswissenschaften","Projektleiter/_Projektmanager","WirtschaftswissenschaftenProjektleiter/_Projektmanager","Marketing"]
["Wirtschaftswissenschaften","Projektleiter/_Projektmanager","WirtschaftswissenschaftenProjektleiter/_Projektmanager","Marktforschung"]
["Wirtschaftswissenschaften","Projektleiter/_Projektmanager","WirtschaftswissenschaftenProjektleiter/_Projektmanager","Mediengestaltung"]
["Wirtschaftswissenschaften","Projektleiter/_Projektmanager","WirtschaftswissenschaftenProjektleiter/_Projektmanager","Online-Marketing"]
["Wirtschaftswissenschaften","Projektleiter/_Projektmanager","WirtschaftswissenschaftenProjektleiter/_Projektmanager","Personalwesen"]
["Wirtschaftswissenschaften","Projektleiter/_Projektmanager","WirtschaftswissenschaftenProjektleiter/_Projektmanager","Planung"]
["Wirtschaftswissenschaften","Projektleiter/_Projektmanager","WirtschaftswissenschaftenProjektleiter/_Projektmanager","Projektmanagement"]
["Wirtschaftswissenschaften","Projektleiter/_Projektmanager","WirtschaftswissenschaftenProjektleiter/_Projektmanager","Public Relation und Unternehmenskommunikation"]
["Wirtschaftswissenschaften","Projektleiter/_Projektmanager","WirtschaftswissenschaftenProjektleiter/_Projektmanager","Qualitätswesen"]
["Wirtschaftswissenschaften","Projektleiter/_Projektmanager","WirtschaftswissenschaftenProjektleiter/_Projektmanager","Rechnungswesen"]
["Wirtschaftswissenschaften","Projektleiter/_Projektmanager","WirtschaftswissenschaftenProjektleiter/_Projektmanager","Risikomanagement"]
["Wirtschaftswissenschaften","Projektleiter/_Projektmanager","WirtschaftswissenschaftenProjektleiter/_Projektmanager","Sozialwesen"]
["Wirtschaftswissenschaften","Projektleiter/_Projektmanager","WirtschaftswissenschaftenProjektleiter/_Projektmanager","Unternehmenskommunikation und Public Relation"]
["Wirtschaftswissenschaften","Projektleiter/_Projektmanager","WirtschaftswissenschaftenProjektleiter/_Projektmanager","Vertrieb-Innendienst"]
["Wirtschaftswissenschaften","Projektleiter/_Projektmanager","WirtschaftswissenschaftenProjektleiter/_Projektmanager","Vertriebssteuerung"]
["Wirtschaftswissenschaften","Projektmitarbeiter","WirtschaftswissenschaftenProjektmitarbeiter","Account Management"]
["Wirtschaftswissenschaften","Projektmitarbeiter","WirtschaftswissenschaftenProjektmitarbeiter","Allgemeine Verwaltung"]
["Wirtschaftswissenschaften","Projektmitarbeiter","WirtschaftswissenschaftenProjektmitarbeiter","Asset Management"]
["Wirtschaftswissenschaften","Projektmitarbeiter","WirtschaftswissenschaftenProjektmitarbeiter","Assistenz der Geschäftsleitung/ des Vorstands"]
["Wirtschaftswissenschaften","Projektmitarbeiter","WirtschaftswissenschaftenProjektmitarbeiter","Aus- und Weiterbildung"]
["Wirtschaftswissenschaften","Projektmitarbeiter","WirtschaftswissenschaftenProjektmitarbeiter","Business Development"]
["Wirtschaftswissenschaften","Projektmitarbeiter","WirtschaftswissenschaftenProjektmitarbeiter","Consulting"]
["Wirtschaftswissenschaften","Projektmitarbeiter","WirtschaftswissenschaftenProjektmitarbeiter","Content Management"]
["Wirtschaftswissenschaften","Projektmitarbeiter","WirtschaftswissenschaftenProjektmitarbeiter","Controlling"]
["Wirtschaftswissenschaften","Projektmitarbeiter","WirtschaftswissenschaftenProjektmitarbeiter","Einkauf und Beschaffung"]
["Wirtschaftswissenschaften","Projektmitarbeiter","WirtschaftswissenschaftenProjektmitarbeiter","Event Management"]
["Wirtschaftswissenschaften","Projektmitarbeiter","WirtschaftswissenschaftenProjektmitarbeiter","Facility Management"]
["Wirtschaftswissenschaften","Projektmitarbeiter","WirtschaftswissenschaftenProjektmitarbeiter","Finanzwesen"]
["Wirtschaftswissenschaften","Projektmitarbeiter","WirtschaftswissenschaftenProjektmitarbeiter","Forschung und Entwicklung"]
["Wirtschaftswissenschaften","Projektmitarbeiter","WirtschaftswissenschaftenProjektmitarbeiter","Gesundheitsmanagement"]
["Wirtschaftswissenschaften","Projektmitarbeiter","WirtschaftswissenschaftenProjektmitarbeiter","Key Account Management"]
["Wirtschaftswissenschaften","Projektmitarbeiter","WirtschaftswissenschaftenProjektmitarbeiter","Logistik"]
["Wirtschaftswissenschaften","Projektmitarbeiter","WirtschaftswissenschaftenProjektmitarbeiter","Marketing"]
["Wirtschaftswissenschaften","Projektmitarbeiter","WirtschaftswissenschaftenProjektmitarbeiter","Marktforschung"]
["Wirtschaftswissenschaften","Projektmitarbeiter","WirtschaftswissenschaftenProjektmitarbeiter","Mediengestaltung"]
["Wirtschaftswissenschaften","Projektmitarbeiter","WirtschaftswissenschaftenProjektmitarbeiter","Online-Marketing"]
["Wirtschaftswissenschaften","Projektmitarbeiter","WirtschaftswissenschaftenProjektmitarbeiter","Personalwesen"]
["Wirtschaftswissenschaften","Projektmitarbeiter","WirtschaftswissenschaftenProjektmitarbeiter","Planung"]
["Wirtschaftswissenschaften","Projektmitarbeiter","WirtschaftswissenschaftenProjektmitarbeiter","Portfoliomanagement"]
["Wirtschaftswissenschaften","Projektmitarbeiter","WirtschaftswissenschaftenProjektmitarbeiter","Produktmanagement"]
["Wirtschaftswissenschaften","Projektmitarbeiter",{"$f":"A1605&B1605&E1605","v":"WirtschaftswissenschaftenProjektmitarbeiter"},"Projektmanagement"]
["Wirtschaftswissenschaften","Projektmitarbeiter","WirtschaftswissenschaftenProjektmitarbeiter","Prozessmanagement"]
["Wirtschaftswissenschaften","Projektmitarbeiter","WirtschaftswissenschaftenProjektmitarbeiter","Public Relation und Unternehmenskommunikation"]
["Wirtschaftswissenschaften","Projektmitarbeiter","WirtschaftswissenschaftenProjektmitarbeiter","Qualitätswesen"]
["Wirtschaftswissenschaften","Projektmitarbeiter","WirtschaftswissenschaftenProjektmitarbeiter","Rechnungswesen"]
["Wirtschaftswissenschaften","Projektmitarbeiter","WirtschaftswissenschaftenProjektmitarbeiter","Redaktion"]
["Wirtschaftswissenschaften","Projektmitarbeiter","WirtschaftswissenschaftenProjektmitarbeiter","Risikomanagement"]
["Wirtschaftswissenschaften","Projektmitarbeiter","WirtschaftswissenschaftenProjektmitarbeiter","Sozialwesen"]
["Wirtschaftswissenschaften","Projektmitarbeiter","WirtschaftswissenschaftenProjektmitarbeiter","Steuer- und Wirtschaftsprüfung"]
["Wirtschaftswissenschaften","Projektmitarbeiter","WirtschaftswissenschaftenProjektmitarbeiter","Strategieentwicklung"]
["Wirtschaftswissenschaften","Projektmitarbeiter","WirtschaftswissenschaftenProjektmitarbeiter","Strategisches Produktmanagement"]
["Wirtschaftswissenschaften","Projektmitarbeiter","WirtschaftswissenschaftenProjektmitarbeiter","Unternehmenskommunikation und Public Relation"]
["Wirtschaftswissenschaften","Projektmitarbeiter","WirtschaftswissenschaftenProjektmitarbeiter","Vertrieb-Außendienst"]
["Wirtschaftswissenschaften","Projektmitarbeiter","WirtschaftswissenschaftenProjektmitarbeiter","Vertrieb-Innendienst"]
["Wirtschaftswissenschaften","Projektmitarbeiter","WirtschaftswissenschaftenProjektmitarbeiter","Vertriebssteuerung"]
["Wirtschaftswissenschaften","Projektmitarbeiter","WirtschaftswissenschaftenProjektmitarbeiter","Wirtschafts- und Steuerprüfung"]
["Wirtschaftswissenschaften","Prozessmanager","WirtschaftswissenschaftenProzessmanager","Prozessmanagement"]
["Wirtschaftswissenschaften","Prüfungsassistent","WirtschaftswissenschaftenPrüfungsassistent","Content Management"]
["Wirtschaftswissenschaften","Prüfungsassistent","WirtschaftswissenschaftenPrüfungsassistent","Controlling"]
["Wirtschaftswissenschaften","Prüfungsassistent","WirtschaftswissenschaftenPrüfungsassistent","Einkauf und Beschaffung"]
["Wirtschaftswissenschaften","Prüfungsassistent","WirtschaftswissenschaftenPrüfungsassistent","Finanzwesen"]
["Wirtschaftswissenschaften","Prüfungsassistent","WirtschaftswissenschaftenPrüfungsassistent","Gesundheitsmanagement"]
["Wirtschaftswissenschaften","Prüfungsassistent","WirtschaftswissenschaftenPrüfungsassistent","Logistik"]
["Wirtschaftswissenschaften","Prüfungsassistent","WirtschaftswissenschaftenPrüfungsassistent","Portfoliomanagement"]
["Wirtschaftswissenschaften","Prüfungsassistent","WirtschaftswissenschaftenPrüfungsassistent","Prozessmanagement"]
["Wirtschaftswissenschaften","Prüfungsassistent","WirtschaftswissenschaftenPrüfungsassistent","Qualitätswesen"]
["Wirtschaftswissenschaften","Prüfungsassistent","WirtschaftswissenschaftenPrüfungsassistent","Rechnungswesen"]
["Wirtschaftswissenschaften","Prüfungsassistent","WirtschaftswissenschaftenPrüfungsassistent","Risikomanagement"]
["Wirtschaftswissenschaften","Prüfungsassistent","WirtschaftswissenschaftenPrüfungsassistent","Steuer- und Wirtschaftsprüfung"]
["Wirtschaftswissenschaften","Prüfungsassistent","WirtschaftswissenschaftenPrüfungsassistent","Wirtschafts- und Steuerprüfung"]
["Wirtschaftswissenschaften","Redakteur","WirtschaftswissenschaftenRedakteur","Redaktion"]
["Wirtschaftswissenschaften","Referent","WirtschaftswissenschaftenReferent","Aus- und Weiterbildung"]
["Wirtschaftswissenschaften","Referent","WirtschaftswissenschaftenReferent","Controlling"]
["Wirtschaftswissenschaften","Referent","WirtschaftswissenschaftenReferent","Event Management"]
["Wirtschaftswissenschaften","Referent","WirtschaftswissenschaftenReferent","Finanzwesen"]
["Wirtschaftswissenschaften","Referent","WirtschaftswissenschaftenReferent","Gesundheitsmanagement"]
["Wirtschaftswissenschaften","Referent","WirtschaftswissenschaftenReferent","Marketing"]
["Wirtschaftswissenschaften","Referent","WirtschaftswissenschaftenReferent","Personalwesen"]
["Wirtschaftswissenschaften","Referent","WirtschaftswissenschaftenReferent","Public Relation und Unternehmenskommunikation"]
["Wirtschaftswissenschaften","Referent","WirtschaftswissenschaftenReferent","Rechnungswesen"]
["Wirtschaftswissenschaften","Referent","WirtschaftswissenschaftenReferent","Unternehmenskommunikation und Public Relation"]
["Wirtschaftswissenschaften","Sales_Manager","WirtschaftswissenschaftenSales_Manager","Vertrieb-Außendienst"]
["Wirtschaftswissenschaften","Steuerassistent/_Wirtschaftsprüfungsassistent","WirtschaftswissenschaftenSteuerassistent/_Wirtschaftsprüfungsassistent","Wirtschafts- und Steuerprüfung"]
["Wirtschaftswissenschaften","Steuerassistent/_Wirtschaftsprüfungsassistent","WirtschaftswissenschaftenSteuerassistent/_Wirtschaftsprüfungsassistent","Steuer- und Wirtschaftsprüfung"]
["Wirtschaftswissenschaften","Strategie_Consultant","WirtschaftswissenschaftenStrategie_Consultant","Consulting"]
["Wirtschaftswissenschaften","Strategie_Consultant","WirtschaftswissenschaftenStrategie_Consultant","Strategieentwicklung"]
["Wirtschaftswissenschaften","Trainee","WirtschaftswissenschaftenTrainee","Account Management"]
["Wirtschaftswissenschaften","Trainee","WirtschaftswissenschaftenTrainee","Asset Management"]
["Wirtschaftswissenschaften","Trainee","WirtschaftswissenschaftenTrainee","Assistenz der Geschäftsleitung/ des Vorstands"]
["Wirtschaftswissenschaften","Trainee","WirtschaftswissenschaftenTrainee","Business Development"]
["Wirtschaftswissenschaften","Trainee","WirtschaftswissenschaftenTrainee","Consulting"]
["Wirtschaftswissenschaften","Trainee","WirtschaftswissenschaftenTrainee","Content Management"]
["Wirtschaftswissenschaften","Trainee","WirtschaftswissenschaftenTrainee","Controlling"]
["Wirtschaftswissenschaften","Trainee","WirtschaftswissenschaftenTrainee","Einkauf und Beschaffung"]
["Wirtschaftswissenschaften","Trainee","WirtschaftswissenschaftenTrainee","Event Management"]
["Wirtschaftswissenschaften","Trainee","WirtschaftswissenschaftenTrainee","Facility Management"]
["Wirtschaftswissenschaften","Trainee","WirtschaftswissenschaftenTrainee","Finanzwesen"]
["Wirtschaftswissenschaften","Trainee","WirtschaftswissenschaftenTrainee","Forschung und Entwicklung"]
["Wirtschaftswissenschaften","Trainee","WirtschaftswissenschaftenTrainee","Gesundheitsmanagement"]
["Wirtschaftswissenschaften","Trainee","WirtschaftswissenschaftenTrainee","Key Account Management"]
["Wirtschaftswissenschaften","Trainee","WirtschaftswissenschaftenTrainee","Logistik"]
["Wirtschaftswissenschaften","Trainee","WirtschaftswissenschaftenTrainee","Marketing"]
["Wirtschaftswissenschaften","Trainee","WirtschaftswissenschaftenTrainee","Marktforschung"]
["Wirtschaftswissenschaften","Trainee","WirtschaftswissenschaftenTrainee","Online-Marketing"]
["Wirtschaftswissenschaften","Trainee",{"$f":"A1669&B1669&E1669","v":"WirtschaftswissenschaftenTrainee"},"Personalwesen"]
["Wirtschaftswissenschaften","Trainee","WirtschaftswissenschaftenTrainee","Portfoliomanagement"]
["Wirtschaftswissenschaften","Trainee","WirtschaftswissenschaftenTrainee","Produktmanagement"]
["Wirtschaftswissenschaften","Trainee","WirtschaftswissenschaftenTrainee","Projektmanagement"]
["Wirtschaftswissenschaften","Trainee","WirtschaftswissenschaftenTrainee","Prozessmanagement"]
["Wirtschaftswissenschaften","Trainee","WirtschaftswissenschaftenTrainee","Public Relation und Unternehmenskommunikation"]
["Wirtschaftswissenschaften","Trainee","WirtschaftswissenschaftenTrainee","Qualitätswesen"]
["Wirtschaftswissenschaften","Trainee","WirtschaftswissenschaftenTrainee","Rechnungswesen"]
["Wirtschaftswissenschaften","Trainee","WirtschaftswissenschaftenTrainee","Redaktion"]
["Wirtschaftswissenschaften","Trainee","WirtschaftswissenschaftenTrainee","Risikomanagement"]
["Wirtschaftswissenschaften","Trainee","WirtschaftswissenschaftenTrainee","Sozialwesen"]
["Wirtschaftswissenschaften","Trainee","WirtschaftswissenschaftenTrainee","Strategieentwicklung"]
["Wirtschaftswissenschaften","Trainee","WirtschaftswissenschaftenTrainee","Strategisches Produktmanagement"]
["Wirtschaftswissenschaften","Trainee","WirtschaftswissenschaftenTrainee","Unternehmenskommunikation und Public Relation"]
["Wirtschaftswissenschaften","Trainee","WirtschaftswissenschaftenTrainee","Vertrieb-Außendienst"]
["Wirtschaftswissenschaften","Trainee","WirtschaftswissenschaftenTrainee","Vertrieb-Innendienst"]
["Wirtschaftswissenschaften","Trainee","WirtschaftswissenschaftenTrainee","Vertriebssteuerung"]
["Wirtschaftswissenschaften","Trainee_Filialleiter/_Verkaufsleiter","WirtschaftswissenschaftenTrainee_Filialleiter/_Verkaufsleiter","Vertrieb-Außendienst"]
["Wirtschaftswissenschaften","Vertriebler","WirtschaftswissenschaftenVertriebler","Vertrieb-Außendienst"]
["Wirtschaftswissenschaften","Vertriebler","WirtschaftswissenschaftenVertriebler","Key Account Management"]
["Wirtschaftswissenschaften","Vertriebler","WirtschaftswissenschaftenVertriebler","Account Management"]
["Wirtschaftswissenschaften","Wirtschaftsprüfungsassistent/_Steuerassistent","WirtschaftswissenschaftenWirtschaftsprüfungsassistent/_Steuerassistent","Wirtschafts- und Steuerprüfung"]
["Wirtschaftswissenschaften","Wirtschaftsprüfungsassistent/_Steuerassistent","WirtschaftswissenschaftenWirtschaftsprüfungsassistent/_Steuerassistent","Steuer- und Wirtschaftsprüfung"]
["Wirtschaftswissenschaften","Wissenschaftlicher_Mitarbeiter","WirtschaftswissenschaftenWissenschaftlicher_Mitarbeiter","Forschung und Entwicklung"]
["Wirtschaftswissenschaften","Wissenschaftlicher_Mitarbeiter","WirtschaftswissenschaftenWissenschaftlicher_Mitarbeiter","Marktforschung"]
["Naturwissenschaften","Account_Manager","NaturwissenschaftenAccount_Manager","Account Management"]
["Naturwissenschaften","Analyst","NaturwissenschaftenAnalyst","Asset Management"]
["Naturwissenschaften","Analyst","NaturwissenschaftenAnalyst","Business Development"]
["Naturwissenschaften","Analyst","NaturwissenschaftenAnalyst","Controlling"]
["Naturwissenschaften","Analyst","NaturwissenschaftenAnalyst","Finanzwesen"]
["Naturwissenschaften","Analyst","NaturwissenschaftenAnalyst","Strategieentwicklung"]
["Naturwissenschaften","Asset_Manager","NaturwissenschaftenAsset_Manager","Asset Management"]
["Naturwissenschaften","Assistent_der_Geschäftsleitung/_des_Vorstands","NaturwissenschaftenAssistent_der_Geschäftsleitung/_des_Vorstands","Assistenz der Geschäftsleitung/ des Vorstands"]
["Naturwissenschaften","Associate","NaturwissenschaftenAssociate","Consulting"]
["Naturwissenschaften","Associate","NaturwissenschaftenAssociate","Finanzwesen"]
["Naturwissenschaften","Associate","NaturwissenschaftenAssociate","Strategieentwicklung"]
["Naturwissenschaften","Business_Development_Manager","NaturwissenschaftenBusiness_Development_Manager","Business Development"]
["Naturwissenschaften","Consultant","NaturwissenschaftenConsultant","Business Development"]
["Naturwissenschaften","Consultant","NaturwissenschaftenConsultant","Consulting"]
["Naturwissenschaften","Consultant","NaturwissenschaftenConsultant","Finanzwesen"]
["Naturwissenschaften","Consultant","NaturwissenschaftenConsultant","IT-Consulting"]
["Naturwissenschaften","Consultant","NaturwissenschaftenConsultant","Strategieentwicklung"]
["Naturwissenschaften","Content_Manager","NaturwissenschaftenContent_Manager","Content Management"]
["Naturwissenschaften","Controller","NaturwissenschaftenController","Controlling"]
["Naturwissenschaften","Controller","NaturwissenschaftenController","Einkauf und Beschaffung"]
["Naturwissenschaften","Controller","NaturwissenschaftenController","Finanzwesen"]
["Naturwissenschaften","Controller","NaturwissenschaftenController","Produktion und Fertigung"]
["Naturwissenschaften","Controller","NaturwissenschaftenControllerEinschränkung","Rechnungswesen","Einschränkung"]
["Naturwissenschaften","Controller","NaturwissenschaftenControllerEinschränkung","Risikomanagement","Einschränkung"]
["Naturwissenschaften","Controller","NaturwissenschaftenController","Vertriebssteuerung"]
["Naturwissenschaften","Einkäufer","NaturwissenschaftenEinkäufer","Einkauf und Beschaffung"]
["Naturwissenschaften","Einkäufer","NaturwissenschaftenEinkäufer","Produktmanagement"]
["Naturwissenschaften","Entwickler","NaturwissenschaftenEntwickler","Engineering"]
["Naturwissenschaften","Entwickler","NaturwissenschaftenEntwickler","Entwicklung"]
["Naturwissenschaften","Entwickler","NaturwissenschaftenEntwickler","Forschung und Entwicklung"]
["Naturwissenschaften","Entwickler","NaturwissenschaftenEntwickler","Konstruktion"]
["Naturwissenschaften","Entwickler","NaturwissenschaftenEntwickler","Projektmanagement"]
["Naturwissenschaften","Entwickler","NaturwissenschaftenEntwickler","Softwareentwicklung"]
["Naturwissenschaften","Key_Account_Manager","NaturwissenschaftenKey_Account_Manager","Key Account Management"]
["Naturwissenschaften","Konstrukteur","NaturwissenschaftenKonstrukteur","Engineering"]
["Naturwissenschaften","Konstrukteur","NaturwissenschaftenKonstrukteur","Entwicklung"]
["Naturwissenschaften","Konstrukteur","NaturwissenschaftenKonstrukteur","Forschung und Entwicklung"]
["Naturwissenschaften","Konstrukteur","NaturwissenschaftenKonstrukteur","Konstruktion"]
["Naturwissenschaften","Konstrukteur","NaturwissenschaftenKonstrukteur","Produktion und Fertigung"]
["Naturwissenschaften","Konstrukteur",{"$f":"A1733&B1733&E1733","v":"NaturwissenschaftenKonstrukteur"},"Projektmanagement"]
["Naturwissenschaften","Laborleiter","NaturwissenschaftenLaborleiter","Forschung und Entwicklung"]
["Naturwissenschaften","Mitarbeiter","NaturwissenschaftenMitarbeiter","Account Management"]
["Naturwissenschaften","Mitarbeiter","NaturwissenschaftenMitarbeiter","Allgemeine Verwaltung"]
["Naturwissenschaften","Mitarbeiter","NaturwissenschaftenMitarbeiter","Asset Management"]
["Naturwissenschaften","Mitarbeiter","NaturwissenschaftenMitarbeiter","Assistenz der Geschäftsleitung/ des Vorstands"]
["Naturwissenschaften","Mitarbeiter","NaturwissenschaftenMitarbeiter","Aus- und Weiterbildung"]
["Naturwissenschaften","Mitarbeiter","NaturwissenschaftenMitarbeiter","Business Development"]
["Naturwissenschaften","Mitarbeiter","NaturwissenschaftenMitarbeiter","Consulting"]
["Naturwissenschaften","Mitarbeiter","NaturwissenschaftenMitarbeiter","Content Management"]
["Naturwissenschaften","Mitarbeiter","NaturwissenschaftenMitarbeiter","Controlling"]
["Naturwissenschaften","Mitarbeiter","NaturwissenschaftenMitarbeiter","Einkauf und Beschaffung"]
["Naturwissenschaften","Mitarbeiter","NaturwissenschaftenMitarbeiter","Engineering"]
["Naturwissenschaften","Mitarbeiter","NaturwissenschaftenMitarbeiter","Entwicklung"]
["Naturwissenschaften","Mitarbeiter","NaturwissenschaftenMitarbeiter","Finanzwesen"]
["Naturwissenschaften","Mitarbeiter","NaturwissenschaftenMitarbeiter","Forschung und Entwicklung"]
["Naturwissenschaften","Mitarbeiter","NaturwissenschaftenMitarbeiter","Gesundheitsmanagement"]
["Naturwissenschaften","Mitarbeiter","NaturwissenschaftenMitarbeiter","IT"]
["Naturwissenschaften","Mitarbeiter","NaturwissenschaftenMitarbeiter","IT-Consulting"]
["Naturwissenschaften","Mitarbeiter","NaturwissenschaftenMitarbeiter","Key Account Management"]
["Naturwissenschaften","Mitarbeiter","NaturwissenschaftenMitarbeiter","Konstruktion"]
["Naturwissenschaften","Mitarbeiter","NaturwissenschaftenMitarbeiter","Logistik"]
["Naturwissenschaften","Mitarbeiter","NaturwissenschaftenMitarbeiter","Marketing"]
["Naturwissenschaften","Mitarbeiter","NaturwissenschaftenMitarbeiter","Marktforschung"]
["Naturwissenschaften","Mitarbeiter","NaturwissenschaftenMitarbeiter","Online-Marketing"]
["Naturwissenschaften","Mitarbeiter","NaturwissenschaftenMitarbeiter","Personalwesen"]
["Naturwissenschaften","Mitarbeiter","NaturwissenschaftenMitarbeiter","Planung"]
["Naturwissenschaften","Mitarbeiter","NaturwissenschaftenMitarbeiter","Portfoliomanagement"]
["Naturwissenschaften","Mitarbeiter","NaturwissenschaftenMitarbeiter","Produktion und Fertigung"]
["Naturwissenschaften","Mitarbeiter","NaturwissenschaftenMitarbeiter","Produktmanagement"]
["Naturwissenschaften","Mitarbeiter","NaturwissenschaftenMitarbeiter","Projektmanagement"]
["Naturwissenschaften","Mitarbeiter","NaturwissenschaftenMitarbeiter","Prozessmanagement"]
["Naturwissenschaften","Mitarbeiter","NaturwissenschaftenMitarbeiter","Public Relation und Unternehmenskommunikation"]
["Naturwissenschaften","Mitarbeiter","NaturwissenschaftenMitarbeiter","Qualitätswesen"]
["Naturwissenschaften","Mitarbeiter","NaturwissenschaftenMitarbeiterEinschränkung","Rechnungswesen","Einschränkung"]
["Naturwissenschaften","Mitarbeiter","NaturwissenschaftenMitarbeiter","Redaktion"]
["Naturwissenschaften","Mitarbeiter","NaturwissenschaftenMitarbeiterEinschränkung","Risikomanagement","Einschränkung"]
["Naturwissenschaften","Mitarbeiter","NaturwissenschaftenMitarbeiter","Softwareentwicklung"]
["Naturwissenschaften","Mitarbeiter","NaturwissenschaftenMitarbeiterEinschränkung","Sozialwesen","Einschränkung"]
["Naturwissenschaften","Mitarbeiter","NaturwissenschaftenMitarbeiter","Strategieentwicklung",null,"x"]
["Naturwissenschaften","Mitarbeiter","NaturwissenschaftenMitarbeiter","Strategisches Produktmanagement"]
["Naturwissenschaften","Mitarbeiter","NaturwissenschaftenMitarbeiterEinschränkung","Therapie","Einschränkung"]
["Naturwissenschaften","Mitarbeiter","NaturwissenschaftenMitarbeiter","Unternehmenskommunikation und Public Relation",null,"x"]
["Naturwissenschaften","Mitarbeiter","NaturwissenschaftenMitarbeiter","Vertrieb-Außendienst"]
["Naturwissenschaften","Mitarbeiter","NaturwissenschaftenMitarbeiter","Vertrieb-Innendienst"]
["Naturwissenschaften","Mitarbeiter","NaturwissenschaftenMitarbeiter","Vertriebssteuerung"]
["Naturwissenschaften","Personalreferent","NaturwissenschaftenPersonalreferent","Personalwesen"]
["Naturwissenschaften","Pharmareferent","NaturwissenschaftenPharmareferent","Account Management"]
["Naturwissenschaften","Pharmareferent","NaturwissenschaftenPharmareferent","Key Account Management"]
["Naturwissenschaften","Pharmareferent","NaturwissenschaftenPharmareferent","Vertrieb-Außendienst"]
["Naturwissenschaften","Portfoliomanager","NaturwissenschaftenPortfoliomanager","Portfoliomanagement"]
["Naturwissenschaften","Produkt_Manager","NaturwissenschaftenProdukt_Manager","Einkauf und Beschaffung"]
["Naturwissenschaften","Produkt_Manager","NaturwissenschaftenProdukt_Manager","Produktmanagement"]
["Naturwissenschaften","Produkt_Manager","NaturwissenschaftenProdukt_Manager","Strategisches Produktmanagement"]
["Naturwissenschaften","Projektingenieur","NaturwissenschaftenProjektingenieur","Engineering"]
["Naturwissenschaften","Projektingenieur","NaturwissenschaftenProjektingenieur","Entwicklung"]
["Naturwissenschaften","Projektingenieur","NaturwissenschaftenProjektingenieur","Forschung und Entwicklung"]
["Naturwissenschaften","Projektingenieur","NaturwissenschaftenProjektingenieur","IT"]
["Naturwissenschaften","Projektingenieur","NaturwissenschaftenProjektingenieur","Konstruktion"]
["Naturwissenschaften","Projektingenieur","NaturwissenschaftenProjektingenieur","Planung"]
["Naturwissenschaften","Projektingenieur","NaturwissenschaftenProjektingenieur","Produktion und Fertigung"]
["Naturwissenschaften","Projektingenieur","NaturwissenschaftenProjektingenieur","Projektmanagement"]
["Naturwissenschaften","Projektingenieur","NaturwissenschaftenProjektingenieur","Prozessmanagement"]
["Naturwissenschaften","Projektingenieur","NaturwissenschaftenProjektingenieur","Qualitätswesen"]
["Naturwissenschaften","Projektingenieur",{"$f":"A1797&B1797&E1797","v":"NaturwissenschaftenProjektingenieur"},"Softwareentwicklung"]
["Naturwissenschaften","Projektleiter/_Projektmanager","NaturwissenschaftenProjektleiter/_Projektmanager","Aus- und Weiterbildung"]
["Naturwissenschaften","Projektleiter/_Projektmanager","NaturwissenschaftenProjektleiter/_Projektmanager","Controlling"]
["Naturwissenschaften","Projektleiter/_Projektmanager","NaturwissenschaftenProjektleiter/_Projektmanager","Einkauf und Beschaffung"]
["Naturwissenschaften","Projektleiter/_Projektmanager","NaturwissenschaftenProjektleiter/_Projektmanager","Engineering"]
["Naturwissenschaften","Projektleiter/_Projektmanager","NaturwissenschaftenProjektleiter/_Projektmanager","Entwicklung"]
["Naturwissenschaften","Projektleiter/_Projektmanager","NaturwissenschaftenProjektleiter/_Projektmanager","Finanzwesen"]
["Naturwissenschaften","Projektleiter/_Projektmanager","NaturwissenschaftenProjektleiter/_Projektmanager","Forschung und Entwicklung"]
["Naturwissenschaften","Projektleiter/_Projektmanager","NaturwissenschaftenProjektleiter/_Projektmanager","Gesundheitsmanagement"]
["Naturwissenschaften","Projektleiter/_Projektmanager","NaturwissenschaftenProjektleiter/_Projektmanager","IT"]
["Naturwissenschaften","Projektleiter/_Projektmanager","NaturwissenschaftenProjektleiter/_Projektmanager","IT-Consulting"]
["Naturwissenschaften","Projektleiter/_Projektmanager","NaturwissenschaftenProjektleiter/_Projektmanager","Konstruktion"]
["Naturwissenschaften","Projektleiter/_Projektmanager","NaturwissenschaftenProjektleiter/_Projektmanager","Logistik"]
["Naturwissenschaften","Projektleiter/_Projektmanager","NaturwissenschaftenProjektleiter/_Projektmanager","Marketing"]
["Naturwissenschaften","Projektleiter/_Projektmanager","NaturwissenschaftenProjektleiter/_Projektmanager","Marktforschung"]
["Naturwissenschaften","Projektleiter/_Projektmanager","NaturwissenschaftenProjektleiter/_Projektmanager","Online-Marketing"]
["Naturwissenschaften","Projektleiter/_Projektmanager","NaturwissenschaftenProjektleiter/_Projektmanager","Personalwesen"]
["Naturwissenschaften","Projektleiter/_Projektmanager","NaturwissenschaftenProjektleiter/_Projektmanager","Planung"]
["Naturwissenschaften","Projektleiter/_Projektmanager","NaturwissenschaftenProjektleiter/_Projektmanager","Produktion und Fertigung"]
["Naturwissenschaften","Projektleiter/_Projektmanager","NaturwissenschaftenProjektleiter/_Projektmanager","Projektmanagement"]
["Naturwissenschaften","Projektleiter/_Projektmanager","NaturwissenschaftenProjektleiter/_Projektmanager","Public Relation und Unternehmenskommunikation"]
["Naturwissenschaften","Projektleiter/_Projektmanager","NaturwissenschaftenProjektleiter/_Projektmanager","Qualitätswesen"]
["Naturwissenschaften","Projektleiter/_Projektmanager","NaturwissenschaftenProjektleiter/_ProjektmanagerEinschränkung","Rechnungswesen","Einschränkung"]
["Naturwissenschaften","Projektleiter/_Projektmanager","NaturwissenschaftenProjektleiter/_ProjektmanagerEinschränkung","Risikomanagement","Einschränkung"]
["Naturwissenschaften","Projektleiter/_Projektmanager","NaturwissenschaftenProjektleiter/_Projektmanager","Softwareentwicklung"]
["Naturwissenschaften","Projektleiter/_Projektmanager","NaturwissenschaftenProjektleiter/_ProjektmanagerEinschränkung","Sozialwesen","Einschränkung"]
["Naturwissenschaften","Projektleiter/_Projektmanager","NaturwissenschaftenProjektleiter/_Projektmanager","Unternehmenskommunikation und Public Relation"]
["Naturwissenschaften","Projektleiter/_Projektmanager","NaturwissenschaftenProjektleiter/_Projektmanager","Vertrieb-Innendienst"]
["Naturwissenschaften","Projektleiter/_Projektmanager","NaturwissenschaftenProjektleiter/_Projektmanager","Vertriebssteuerung"]
["Naturwissenschaften","Projektmitarbeiter","NaturwissenschaftenProjektmitarbeiter","Account Management"]
["Naturwissenschaften","Projektmitarbeiter","NaturwissenschaftenProjektmitarbeiter","Allgemeine Verwaltung"]
["Naturwissenschaften","Projektmitarbeiter","NaturwissenschaftenProjektmitarbeiter","Asset Management"]
["Naturwissenschaften","Projektmitarbeiter","NaturwissenschaftenProjektmitarbeiter","Assistenz der Geschäftsleitung/ des Vorstands"]
["Naturwissenschaften","Projektmitarbeiter","NaturwissenschaftenProjektmitarbeiter","Aus- und Weiterbildung"]
["Naturwissenschaften","Projektmitarbeiter","NaturwissenschaftenProjektmitarbeiter","Business Development"]
["Naturwissenschaften","Projektmitarbeiter","NaturwissenschaftenProjektmitarbeiter","Consulting"]
["Naturwissenschaften","Projektmitarbeiter","NaturwissenschaftenProjektmitarbeiter","Content Management"]
["Naturwissenschaften","Projektmitarbeiter","NaturwissenschaftenProjektmitarbeiter","Controlling"]
["Naturwissenschaften","Projektmitarbeiter","NaturwissenschaftenProjektmitarbeiter","Einkauf und Beschaffung"]
["Naturwissenschaften","Projektmitarbeiter","NaturwissenschaftenProjektmitarbeiter","Engineering"]
["Naturwissenschaften","Projektmitarbeiter","NaturwissenschaftenProjektmitarbeiter","Entwicklung"]
["Naturwissenschaften","Projektmitarbeiter","NaturwissenschaftenProjektmitarbeiter","Finanzwesen"]
["Naturwissenschaften","Projektmitarbeiter","NaturwissenschaftenProjektmitarbeiter","Forschung und Entwicklung"]
["Naturwissenschaften","Projektmitarbeiter","NaturwissenschaftenProjektmitarbeiter","Gesundheitsmanagement"]
["Naturwissenschaften","Projektmitarbeiter","NaturwissenschaftenProjektmitarbeiter","IT"]
["Naturwissenschaften","Projektmitarbeiter","NaturwissenschaftenProjektmitarbeiter","IT-Consulting"]
["Naturwissenschaften","Projektmitarbeiter","NaturwissenschaftenProjektmitarbeiter","Key Account Management"]
["Naturwissenschaften","Projektmitarbeiter","NaturwissenschaftenProjektmitarbeiter","Konstruktion"]
["Naturwissenschaften","Projektmitarbeiter","NaturwissenschaftenProjektmitarbeiter","Logistik"]
["Naturwissenschaften","Projektmitarbeiter","NaturwissenschaftenProjektmitarbeiter","Marketing"]
["Naturwissenschaften","Projektmitarbeiter","NaturwissenschaftenProjektmitarbeiter","Marktforschung"]
["Naturwissenschaften","Projektmitarbeiter","NaturwissenschaftenProjektmitarbeiter","Online-Marketing"]
["Naturwissenschaften","Projektmitarbeiter","NaturwissenschaftenProjektmitarbeiter","Personalwesen"]
["Naturwissenschaften","Projektmitarbeiter","NaturwissenschaftenProjektmitarbeiter","Planung"]
["Naturwissenschaften","Projektmitarbeiter","NaturwissenschaftenProjektmitarbeiter","Portfoliomanagement"]
["Naturwissenschaften","Projektmitarbeiter","NaturwissenschaftenProjektmitarbeiter","Produktion und Fertigung"]
["Naturwissenschaften","Projektmitarbeiter","NaturwissenschaftenProjektmitarbeiter","Produktmanagement"]
["Naturwissenschaften","Projektmitarbeiter","NaturwissenschaftenProjektmitarbeiter","Projektmanagement"]
["Naturwissenschaften","Projektmitarbeiter","NaturwissenschaftenProjektmitarbeiter","Prozessmanagement"]
["Naturwissenschaften","Projektmitarbeiter","NaturwissenschaftenProjektmitarbeiter","Public Relation und Unternehmenskommunikation"]
["Naturwissenschaften","Projektmitarbeiter","NaturwissenschaftenProjektmitarbeiter","Qualitätswesen"]
["Naturwissenschaften","Projektmitarbeiter","NaturwissenschaftenProjektmitarbeiterEinschränkung","Rechnungswesen","Einschränkung"]
["Naturwissenschaften","Projektmitarbeiter","NaturwissenschaftenProjektmitarbeiter","Redaktion"]
["Naturwissenschaften","Projektmitarbeiter","NaturwissenschaftenProjektmitarbeiterEinschränkung","Risikomanagement","Einschränkung"]
["Naturwissenschaften","Projektmitarbeiter",{"$f":"A1861&B1861&E1861","v":"NaturwissenschaftenProjektmitarbeiter"},"Softwareentwicklung"]
["Naturwissenschaften","Projektmitarbeiter","NaturwissenschaftenProjektmitarbeiterEinschränkung","Sozialwesen","Einschränkung"]
["Naturwissenschaften","Projektmitarbeiter","NaturwissenschaftenProjektmitarbeiter","Strategieentwicklung"]
["Naturwissenschaften","Projektmitarbeiter","NaturwissenschaftenProjektmitarbeiter","Strategisches Produktmanagement"]
["Naturwissenschaften","Projektmitarbeiter","NaturwissenschaftenProjektmitarbeiterEinschränkung","Therapie","Einschränkung"]
["Naturwissenschaften","Projektmitarbeiter","NaturwissenschaftenProjektmitarbeiter","Unternehmenskommunikation und Public Relation"]
["Naturwissenschaften","Projektmitarbeiter","NaturwissenschaftenProjektmitarbeiter","Vertrieb-Außendienst"]
["Naturwissenschaften","Projektmitarbeiter","NaturwissenschaftenProjektmitarbeiter","Vertrieb-Innendienst"]
["Naturwissenschaften","Projektmitarbeiter","NaturwissenschaftenProjektmitarbeiter","Vertriebssteuerung"]
["Naturwissenschaften","Prozessmanager","NaturwissenschaftenProzessmanager","Prozessmanagement"]
["Naturwissenschaften","Prüfungsassistent","NaturwissenschaftenPrüfungsassistent","Content Management"]
["Naturwissenschaften","Prüfungsassistent","NaturwissenschaftenPrüfungsassistent","Controlling"]
["Naturwissenschaften","Prüfungsassistent","NaturwissenschaftenPrüfungsassistent","Einkauf und Beschaffung"]
["Naturwissenschaften","Prüfungsassistent","NaturwissenschaftenPrüfungsassistent","Engineering"]
["Naturwissenschaften","Prüfungsassistent","NaturwissenschaftenPrüfungsassistent","Entwicklung"]
["Naturwissenschaften","Prüfungsassistent","NaturwissenschaftenPrüfungsassistent","Finanzwesen"]
["Naturwissenschaften","Prüfungsassistent","NaturwissenschaftenPrüfungsassistent","Gesundheitsmanagement"]
["Naturwissenschaften","Prüfungsassistent","NaturwissenschaftenPrüfungsassistent","Konstruktion"]
["Naturwissenschaften","Prüfungsassistent","NaturwissenschaftenPrüfungsassistent","Logistik"]
["Naturwissenschaften","Prüfungsassistent","NaturwissenschaftenPrüfungsassistent","Portfoliomanagement"]
["Naturwissenschaften","Prüfungsassistent","NaturwissenschaftenPrüfungsassistent","Produktion und Fertigung"]
["Naturwissenschaften","Prüfungsassistent","NaturwissenschaftenPrüfungsassistent","Prozessmanagement"]
["Naturwissenschaften","Prüfungsassistent","NaturwissenschaftenPrüfungsassistent","Qualitätswesen"]
["Naturwissenschaften","Prüfungsassistent","NaturwissenschaftenPrüfungsassistentEinschränkung","Rechnungswesen","Einschränkung"]
["Naturwissenschaften","Prüfungsassistent","NaturwissenschaftenPrüfungsassistentEinschränkung","Risikomanagement","Einschränkung"]
["Naturwissenschaften","Redakteur","NaturwissenschaftenRedakteur","Redaktion"]
["Naturwissenschaften","Referent","NaturwissenschaftenReferent","Aus- und Weiterbildung"]
["Naturwissenschaften","Referent","NaturwissenschaftenReferent","Controlling"]
["Naturwissenschaften","Referent","NaturwissenschaftenReferent","Finanzwesen"]
["Naturwissenschaften","Referent","NaturwissenschaftenReferent","Gesundheitsmanagement"]
["Naturwissenschaften","Referent","NaturwissenschaftenReferent","Marketing"]
["Naturwissenschaften","Referent","NaturwissenschaftenReferent","Personalwesen"]
["Naturwissenschaften","Referent","NaturwissenschaftenReferent","Public Relation und Unternehmenskommunikation"]
["Naturwissenschaften","Referent","NaturwissenschaftenReferentEinschränkung","Rechnungswesen","Einschränkung"]
["Naturwissenschaften","Referent","NaturwissenschaftenReferent","Unternehmenskommunikation und Public Relation"]
["Naturwissenschaften","Sales_Manager","NaturwissenschaftenSales_Manager","Vertrieb-Außendienst"]
["Naturwissenschaften","Softwareentwickler","NaturwissenschaftenSoftwareentwickler","IT"]
["Naturwissenschaften","Softwareentwickler","NaturwissenschaftenSoftwareentwickler","IT-Consulting"]
["Naturwissenschaften","Softwareentwickler","NaturwissenschaftenSoftwareentwickler","Projektmanagement"]
["Naturwissenschaften","Softwareentwickler","NaturwissenschaftenSoftwareentwickler","Softwareentwicklung"]
["Naturwissenschaften","Strategie_Consultant","NaturwissenschaftenStrategie_Consultant","Consulting"]
["Naturwissenschaften","Strategie_Consultant","NaturwissenschaftenStrategie_Consultant","Strategieentwicklung"]
["Naturwissenschaften","Technischer_Angestellter","NaturwissenschaftenTechnischer_Angestellter","Engineering"]
["Naturwissenschaften","Technischer_Angestellter","NaturwissenschaftenTechnischer_Angestellter","Entwicklung"]
["Naturwissenschaften","Technischer_Angestellter","NaturwissenschaftenTechnischer_Angestellter","Forschung und Entwicklung"]
["Naturwissenschaften","Technischer_Angestellter","NaturwissenschaftenTechnischer_Angestellter","IT"]
["Naturwissenschaften","Technischer_Angestellter","NaturwissenschaftenTechnischer_Angestellter","Konstruktion"]
["Naturwissenschaften","Technischer_Angestellter","NaturwissenschaftenTechnischer_Angestellter","Planung"]
["Naturwissenschaften","Technischer_Angestellter","NaturwissenschaftenTechnischer_Angestellter","Produktion und Fertigung"]
["Naturwissenschaften","Technischer_Angestellter","NaturwissenschaftenTechnischer_Angestellter","Projektmanagement"]
["Naturwissenschaften","Technischer_Angestellter","NaturwissenschaftenTechnischer_Angestellter","Prozessmanagement"]
["Naturwissenschaften","Trainee","NaturwissenschaftenTrainee","Account Management"]
["Naturwissenschaften","Trainee","NaturwissenschaftenTrainee","Asset Management"]
["Naturwissenschaften","Trainee","NaturwissenschaftenTrainee","Assistenz der Geschäftsleitung/ des Vorstands"]
["Naturwissenschaften","Trainee","NaturwissenschaftenTrainee","Business Development"]
["Naturwissenschaften","Trainee","NaturwissenschaftenTrainee","Consulting"]
["Naturwissenschaften","Trainee","NaturwissenschaftenTrainee","Content Management"]
["Naturwissenschaften","Trainee","NaturwissenschaftenTrainee","Controlling"]
["Naturwissenschaften","Trainee","NaturwissenschaftenTrainee","Einkauf und Beschaffung"]
["Naturwissenschaften","Trainee","NaturwissenschaftenTrainee","Engineering"]
["Naturwissenschaften","Trainee","NaturwissenschaftenTrainee","Entwicklung"]
["Naturwissenschaften","Trainee","NaturwissenschaftenTrainee","Finanzwesen"]
["Naturwissenschaften","Trainee","NaturwissenschaftenTrainee","Forschung und Entwicklung"]
["Naturwissenschaften","Trainee","NaturwissenschaftenTrainee","Gesundheitsmanagement"]
["Naturwissenschaften","Trainee",{"$f":"A1925&B1925&E1925","v":"NaturwissenschaftenTrainee"},"IT"]
["Naturwissenschaften","Trainee","NaturwissenschaftenTrainee","IT-Consulting"]
["Naturwissenschaften","Trainee","NaturwissenschaftenTrainee","Key Account Management"]
["Naturwissenschaften","Trainee","NaturwissenschaftenTrainee","Konstruktion"]
["Naturwissenschaften","Trainee","NaturwissenschaftenTrainee","Logistik"]
["Naturwissenschaften","Trainee","NaturwissenschaftenTrainee","Marketing"]
["Naturwissenschaften","Trainee","NaturwissenschaftenTrainee","Marktforschung"]
["Naturwissenschaften","Trainee","NaturwissenschaftenTrainee","Online-Marketing"]
["Naturwissenschaften","Trainee","NaturwissenschaftenTrainee","Personalwesen"]
["Naturwissenschaften","Trainee","NaturwissenschaftenTrainee","Portfoliomanagement"]
["Naturwissenschaften","Trainee","NaturwissenschaftenTrainee","Produktion und Fertigung"]
["Naturwissenschaften","Trainee","NaturwissenschaftenTrainee","Produktmanagement"]
["Naturwissenschaften","Trainee","NaturwissenschaftenTrainee","Projektmanagement"]
["Naturwissenschaften","Trainee","NaturwissenschaftenTrainee","Prozessmanagement"]
["Naturwissenschaften","Trainee","NaturwissenschaftenTrainee","Public Relation und Unternehmenskommunikation"]
["Naturwissenschaften","Trainee","NaturwissenschaftenTrainee","Qualitätswesen"]
["Naturwissenschaften","Trainee","NaturwissenschaftenTraineeEinschränkung","Rechnungswesen","Einschränkung"]
["Naturwissenschaften","Trainee","NaturwissenschaftenTrainee","Redaktion"]
["Naturwissenschaften","Trainee","NaturwissenschaftenTraineeEinschränkung","Risikomanagement","Einschränkung"]
["Naturwissenschaften","Trainee","NaturwissenschaftenTrainee","Softwareentwicklung"]
["Naturwissenschaften","Trainee","NaturwissenschaftenTraineeEinschränkung","Sozialwesen","Einschränkung"]
["Naturwissenschaften","Trainee","NaturwissenschaftenTrainee","Strategieentwicklung"]
["Naturwissenschaften","Trainee","NaturwissenschaftenTrainee","Strategisches Produktmanagement"]
["Naturwissenschaften","Trainee","NaturwissenschaftenTrainee","Unternehmenskommunikation und Public Relation"]
["Naturwissenschaften","Trainee","NaturwissenschaftenTrainee","Vertrieb-Außendienst"]
["Naturwissenschaften","Trainee","NaturwissenschaftenTrainee","Vertrieb-Innendienst"]
["Naturwissenschaften","Trainee","NaturwissenschaftenTrainee","Vertriebssteuerung"]
["Naturwissenschaften","Trainee_Filialleiter/_Verkaufsleiter","NaturwissenschaftenTrainee_Filialleiter/_Verkaufsleiter","Vertrieb-Außendienst"]
["Naturwissenschaften","Vertriebler","NaturwissenschaftenVertriebler","Vertrieb-Außendienst"]
["Naturwissenschaften","Vertriebler","NaturwissenschaftenVertriebler","Key Account Management"]
["Naturwissenschaften","Vertriebler","NaturwissenschaftenVertriebler","Account Management"]
["Naturwissenschaften","Wissenschaftlicher_Mitarbeiter","NaturwissenschaftenWissenschaftlicher_Mitarbeiter","Forschung und Entwicklung"]
["Naturwissenschaften","Wissenschaftlicher_Mitarbeiter","NaturwissenschaftenWissenschaftlicher_Mitarbeiter","Marktforschung"]
["Naturwissenschaften","Mitarbeiter","NaturwissenschaftenMitarbeiterallg_Psy","Account Management","allg_Psy"]
["Naturwissenschaften","Mitarbeiter","NaturwissenschaftenMitarbeiterallg_Psy","Allgemeine Verwaltung","allg_Psy"]
["Naturwissenschaften","Mitarbeiter","NaturwissenschaftenMitarbeiterallg_Psy","Asset Management","allg_Psy"]
["Naturwissenschaften","Mitarbeiter","NaturwissenschaftenMitarbeiterallg_Psy","Assistenz der Geschäftsleitung/ des Vorstands","allg_Psy"]
["Naturwissenschaften","Mitarbeiter","NaturwissenschaftenMitarbeiterallg_Psy","Aus- und Weiterbildung","allg_Psy"]
["Naturwissenschaften","Mitarbeiter","NaturwissenschaftenMitarbeiterallg_Psy","Business Development","allg_Psy"]
["Naturwissenschaften","Mitarbeiter","NaturwissenschaftenMitarbeiterallg_Psy","Consulting","allg_Psy"]
["Naturwissenschaften","Mitarbeiter","NaturwissenschaftenMitarbeiterallg_Psy","Content Management","allg_Psy"]
["Naturwissenschaften","Mitarbeiter","NaturwissenschaftenMitarbeiterallg_Psy","Controlling","allg_Psy"]
["Naturwissenschaften","Mitarbeiter","NaturwissenschaftenMitarbeiterallg_Psy","Einkauf und Beschaffung","allg_Psy"]
["Naturwissenschaften","Mitarbeiter","NaturwissenschaftenMitarbeiterallg_Psy","Engineering","allg_Psy"]
["Naturwissenschaften","Mitarbeiter","NaturwissenschaftenMitarbeiterallg_Psy","Entwicklung","allg_Psy"]
["Naturwissenschaften","Mitarbeiter","NaturwissenschaftenMitarbeiterallg_Psy","Finanzwesen","allg_Psy"]
["Naturwissenschaften","Mitarbeiter","NaturwissenschaftenMitarbeiterallg_Psy","Forschung und Entwicklung","allg_Psy"]
["Naturwissenschaften","Mitarbeiter","NaturwissenschaftenMitarbeiterallg_Psy","Gesundheitsmanagement","allg_Psy"]
["Naturwissenschaften","Mitarbeiter","NaturwissenschaftenMitarbeiterallg_Psy","IT","allg_Psy"]
["Naturwissenschaften","Mitarbeiter","NaturwissenschaftenMitarbeiterallg_Psy","IT-Consulting","allg_Psy"]
["Naturwissenschaften","Mitarbeiter","NaturwissenschaftenMitarbeiterallg_Psy","Key Account Management","allg_Psy"]
["Naturwissenschaften","Mitarbeiter","NaturwissenschaftenMitarbeiterallg_Psy","Konstruktion","allg_Psy"]
["Naturwissenschaften","Mitarbeiter","NaturwissenschaftenMitarbeiterallg_Psy","Logistik","allg_Psy"]
["Naturwissenschaften","Mitarbeiter","NaturwissenschaftenMitarbeiterallg_Psy","Marketing","allg_Psy"]
["Naturwissenschaften","Mitarbeiter","NaturwissenschaftenMitarbeiterallg_Psy","Marktforschung","allg_Psy"]
["Naturwissenschaften","Mitarbeiter","NaturwissenschaftenMitarbeiterallg_Psy","Online-Marketing","allg_Psy"]
["Naturwissenschaften","Mitarbeiter","NaturwissenschaftenMitarbeiterallg_Psy","Personalwesen","allg_Psy"]
["Naturwissenschaften","Mitarbeiter","NaturwissenschaftenMitarbeiterallg_Psy","Planung","allg_Psy"]
["Naturwissenschaften","Mitarbeiter","NaturwissenschaftenMitarbeiterallg_Psy","Portfoliomanagement","allg_Psy"]
["Naturwissenschaften","Mitarbeiter","NaturwissenschaftenMitarbeiterallg_Psy","Produktion und Fertigung","allg_Psy"]
["Naturwissenschaften","Mitarbeiter","NaturwissenschaftenMitarbeiterallg_Psy","Produktmanagement","allg_Psy"]
["Naturwissenschaften","Mitarbeiter","NaturwissenschaftenMitarbeiterallg_Psy","Projektmanagement","allg_Psy"]
["Naturwissenschaften","Mitarbeiter","NaturwissenschaftenMitarbeiterallg_Psy","Prozessmanagement","allg_Psy"]
["Naturwissenschaften","Mitarbeiter","NaturwissenschaftenMitarbeiterallg_Psy","Public Relation und Unternehmenskommunikation","allg_Psy"]
["Naturwissenschaften","Mitarbeiter",{"$f":"A1989&B1989&E1989","v":"NaturwissenschaftenMitarbeiterallg_Psy"},"Qualitätswesen","allg_Psy"]
["Naturwissenschaften","Mitarbeiter","NaturwissenschaftenMitarbeiterallg_Psy","Redaktion","allg_Psy"]
["Naturwissenschaften","Mitarbeiter","NaturwissenschaftenMitarbeiterallg_Psy","Softwareentwicklung","allg_Psy"]
["Naturwissenschaften","Mitarbeiter","NaturwissenschaftenMitarbeiterallg_Psy","Sozialwesen","allg_Psy"]
["Naturwissenschaften","Mitarbeiter","NaturwissenschaftenMitarbeiterallg_Psy","Strategieentwicklung","allg_Psy"]
["Naturwissenschaften","Mitarbeiter","NaturwissenschaftenMitarbeiterallg_Psy","Strategisches Produktmanagement","allg_Psy"]
["Naturwissenschaften","Mitarbeiter","NaturwissenschaftenMitarbeiterallg_Psy","Therapie","allg_Psy"]
["Naturwissenschaften","Mitarbeiter","NaturwissenschaftenMitarbeiterallg_Psy","Unternehmenskommunikation und Public Relation","allg_Psy"]
["Naturwissenschaften","Mitarbeiter","NaturwissenschaftenMitarbeiterallg_Psy","Vertrieb-Außendienst","allg_Psy"]
["Naturwissenschaften","Mitarbeiter","NaturwissenschaftenMitarbeiterallg_Psy","Vertrieb-Innendienst","allg_Psy"]
["Naturwissenschaften","Mitarbeiter","NaturwissenschaftenMitarbeiterallg_Psy","Vertriebssteuerung","allg_Psy"]
["Naturwissenschaften","Projektleiter/_Projektmanager","NaturwissenschaftenProjektleiter/_Projektmanagerallg_Psy","Aus- und Weiterbildung","allg_Psy"]
["Naturwissenschaften","Projektleiter/_Projektmanager","NaturwissenschaftenProjektleiter/_Projektmanagerallg_Psy","Controlling","allg_Psy"]
["Naturwissenschaften","Projektleiter/_Projektmanager","NaturwissenschaftenProjektleiter/_Projektmanagerallg_Psy","Einkauf und Beschaffung","allg_Psy"]
["Naturwissenschaften","Projektleiter/_Projektmanager","NaturwissenschaftenProjektleiter/_Projektmanagerallg_Psy","Engineering","allg_Psy"]
["Naturwissenschaften","Projektleiter/_Projektmanager","NaturwissenschaftenProjektleiter/_Projektmanagerallg_Psy","Entwicklung","allg_Psy"]
["Naturwissenschaften","Projektleiter/_Projektmanager","NaturwissenschaftenProjektleiter/_Projektmanagerallg_Psy","Finanzwesen","allg_Psy"]
["Naturwissenschaften","Projektleiter/_Projektmanager","NaturwissenschaftenProjektleiter/_Projektmanagerallg_Psy","Forschung und Entwicklung","allg_Psy"]
["Naturwissenschaften","Projektleiter/_Projektmanager","NaturwissenschaftenProjektleiter/_Projektmanagerallg_Psy","Gesundheitsmanagement","allg_Psy"]
["Naturwissenschaften","Projektleiter/_Projektmanager","NaturwissenschaftenProjektleiter/_Projektmanagerallg_Psy","IT","allg_Psy"]
["Naturwissenschaften","Projektleiter/_Projektmanager","NaturwissenschaftenProjektleiter/_Projektmanagerallg_Psy","IT-Consulting","allg_Psy"]
["Naturwissenschaften","Projektleiter/_Projektmanager","NaturwissenschaftenProjektleiter/_Projektmanagerallg_Psy","Konstruktion","allg_Psy"]
["Naturwissenschaften","Projektleiter/_Projektmanager","NaturwissenschaftenProjektleiter/_Projektmanagerallg_Psy","Logistik","allg_Psy"]
["Naturwissenschaften","Projektleiter/_Projektmanager","NaturwissenschaftenProjektleiter/_Projektmanagerallg_Psy","Marketing","allg_Psy"]
["Naturwissenschaften","Projektleiter/_Projektmanager","NaturwissenschaftenProjektleiter/_Projektmanagerallg_Psy","Marktforschung","allg_Psy"]
["Naturwissenschaften","Projektleiter/_Projektmanager","NaturwissenschaftenProjektleiter/_Projektmanagerallg_Psy","Online-Marketing","allg_Psy"]
["Naturwissenschaften","Projektleiter/_Projektmanager","NaturwissenschaftenProjektleiter/_Projektmanagerallg_Psy","Personalwesen","allg_Psy"]
["Naturwissenschaften","Projektleiter/_Projektmanager","NaturwissenschaftenProjektleiter/_Projektmanagerallg_Psy","Planung","allg_Psy"]
["Naturwissenschaften","Projektleiter/_Projektmanager","NaturwissenschaftenProjektleiter/_Projektmanagerallg_Psy","Produktion und Fertigung","allg_Psy"]
["Naturwissenschaften","Projektleiter/_Projektmanager","NaturwissenschaftenProjektleiter/_Projektmanagerallg_Psy","Projektmanagement","allg_Psy"]
["Naturwissenschaften","Projektleiter/_Projektmanager","NaturwissenschaftenProjektleiter/_Projektmanagerallg_Psy","Public Relation und Unternehmenskommunikation","allg_Psy"]
["Naturwissenschaften","Projektleiter/_Projektmanager","NaturwissenschaftenProjektleiter/_Projektmanagerallg_Psy","Qualitätswesen","allg_Psy"]
["Naturwissenschaften","Projektleiter/_Projektmanager","NaturwissenschaftenProjektleiter/_Projektmanagerallg_Psy","Softwareentwicklung","allg_Psy"]
["Naturwissenschaften","Projektleiter/_Projektmanager","NaturwissenschaftenProjektleiter/_Projektmanagerallg_Psy","Sozialwesen","allg_Psy"]
["Naturwissenschaften","Projektleiter/_Projektmanager","NaturwissenschaftenProjektleiter/_Projektmanagerallg_Psy","Unternehmenskommunikation und Public Relation","allg_Psy"]
["Naturwissenschaften","Projektleiter/_Projektmanager","NaturwissenschaftenProjektleiter/_Projektmanagerallg_Psy","Vertrieb-Innendienst","allg_Psy"]
["Naturwissenschaften","Projektleiter/_Projektmanager","NaturwissenschaftenProjektleiter/_Projektmanagerallg_Psy","Vertriebssteuerung","allg_Psy"]
["Naturwissenschaften","Projektmitarbeiter","NaturwissenschaftenProjektmitarbeiterallg_Psy","Account Management","allg_Psy"]
["Naturwissenschaften","Projektmitarbeiter","NaturwissenschaftenProjektmitarbeiterallg_Psy","Allgemeine Verwaltung","allg_Psy"]
["Naturwissenschaften","Projektmitarbeiter","NaturwissenschaftenProjektmitarbeiterallg_Psy","Asset Management","allg_Psy"]
["Naturwissenschaften","Projektmitarbeiter","NaturwissenschaftenProjektmitarbeiterallg_Psy","Assistenz der Geschäftsleitung/ des Vorstands","allg_Psy"]
["Naturwissenschaften","Projektmitarbeiter","NaturwissenschaftenProjektmitarbeiterallg_Psy","Aus- und Weiterbildung","allg_Psy"]
["Naturwissenschaften","Projektmitarbeiter","NaturwissenschaftenProjektmitarbeiterallg_Psy","Business Development","allg_Psy"]
["Naturwissenschaften","Projektmitarbeiter","NaturwissenschaftenProjektmitarbeiterallg_Psy","Consulting","allg_Psy"]
["Naturwissenschaften","Projektmitarbeiter","NaturwissenschaftenProjektmitarbeiterallg_Psy","Content Management","allg_Psy"]
["Naturwissenschaften","Projektmitarbeiter","NaturwissenschaftenProjektmitarbeiterallg_Psy","Controlling","allg_Psy"]
["Naturwissenschaften","Projektmitarbeiter","NaturwissenschaftenProjektmitarbeiterallg_Psy","Einkauf und Beschaffung","allg_Psy"]
["Naturwissenschaften","Projektmitarbeiter","NaturwissenschaftenProjektmitarbeiterallg_Psy","Engineering","allg_Psy"]
["Naturwissenschaften","Projektmitarbeiter","NaturwissenschaftenProjektmitarbeiterallg_Psy","Entwicklung","allg_Psy"]
["Naturwissenschaften","Projektmitarbeiter","NaturwissenschaftenProjektmitarbeiterallg_Psy","Finanzwesen","allg_Psy"]
["Naturwissenschaften","Projektmitarbeiter","NaturwissenschaftenProjektmitarbeiterallg_Psy","Forschung und Entwicklung","allg_Psy"]
["Naturwissenschaften","Projektmitarbeiter","NaturwissenschaftenProjektmitarbeiterallg_Psy","Gesundheitsmanagement","allg_Psy"]
["Naturwissenschaften","Projektmitarbeiter","NaturwissenschaftenProjektmitarbeiterallg_Psy","IT","allg_Psy"]
["Naturwissenschaften","Projektmitarbeiter","NaturwissenschaftenProjektmitarbeiterallg_Psy","IT-Consulting","allg_Psy"]
["Naturwissenschaften","Projektmitarbeiter","NaturwissenschaftenProjektmitarbeiterallg_Psy","Key Account Management","allg_Psy"]
["Naturwissenschaften","Projektmitarbeiter","NaturwissenschaftenProjektmitarbeiterallg_Psy","Konstruktion","allg_Psy"]
["Naturwissenschaften","Projektmitarbeiter","NaturwissenschaftenProjektmitarbeiterallg_Psy","Logistik","allg_Psy"]
["Naturwissenschaften","Projektmitarbeiter","NaturwissenschaftenProjektmitarbeiterallg_Psy","Marketing","allg_Psy"]
["Naturwissenschaften","Projektmitarbeiter","NaturwissenschaftenProjektmitarbeiterallg_Psy","Marktforschung","allg_Psy"]
["Naturwissenschaften","Projektmitarbeiter","NaturwissenschaftenProjektmitarbeiterallg_Psy","Online-Marketing","allg_Psy"]
["Naturwissenschaften","Projektmitarbeiter","NaturwissenschaftenProjektmitarbeiterallg_Psy","Personalwesen","allg_Psy"]
["Naturwissenschaften","Projektmitarbeiter","NaturwissenschaftenProjektmitarbeiterallg_Psy","Planung","allg_Psy"]
["Naturwissenschaften","Projektmitarbeiter","NaturwissenschaftenProjektmitarbeiterallg_Psy","Portfoliomanagement","allg_Psy"]
["Naturwissenschaften","Projektmitarbeiter","NaturwissenschaftenProjektmitarbeiterallg_Psy","Produktion und Fertigung","allg_Psy"]
["Naturwissenschaften","Projektmitarbeiter",{"$f":"A2053&B2053&E2053","v":"NaturwissenschaftenProjektmitarbeiterallg_Psy"},"Produktmanagement","allg_Psy"]
["Naturwissenschaften","Projektmitarbeiter","NaturwissenschaftenProjektmitarbeiterallg_Psy","Projektmanagement","allg_Psy"]
["Naturwissenschaften","Projektmitarbeiter","NaturwissenschaftenProjektmitarbeiterallg_Psy","Prozessmanagement","allg_Psy"]
["Naturwissenschaften","Projektmitarbeiter","NaturwissenschaftenProjektmitarbeiterallg_Psy","Public Relation und Unternehmenskommunikation","allg_Psy"]
["Naturwissenschaften","Projektmitarbeiter","NaturwissenschaftenProjektmitarbeiterallg_Psy","Qualitätswesen","allg_Psy"]
["Naturwissenschaften","Projektmitarbeiter","NaturwissenschaftenProjektmitarbeiterallg_Psy","Redaktion","allg_Psy"]
["Naturwissenschaften","Projektmitarbeiter","NaturwissenschaftenProjektmitarbeiterallg_Psy","Softwareentwicklung","allg_Psy"]
["Naturwissenschaften","Projektmitarbeiter","NaturwissenschaftenProjektmitarbeiterallg_Psy","Sozialwesen","allg_Psy"]
["Naturwissenschaften","Projektmitarbeiter","NaturwissenschaftenProjektmitarbeiterallg_Psy","Strategieentwicklung","allg_Psy"]
["Naturwissenschaften","Projektmitarbeiter","NaturwissenschaftenProjektmitarbeiterallg_Psy","Strategisches Produktmanagement","allg_Psy"]
["Naturwissenschaften","Projektmitarbeiter","NaturwissenschaftenProjektmitarbeiterallg_Psy","Therapie","allg_Psy"]
["Naturwissenschaften","Projektmitarbeiter","NaturwissenschaftenProjektmitarbeiterallg_Psy","Unternehmenskommunikation und Public Relation","allg_Psy"]
["Naturwissenschaften","Projektmitarbeiter","NaturwissenschaftenProjektmitarbeiterallg_Psy","Vertrieb-Außendienst","allg_Psy"]
["Naturwissenschaften","Projektmitarbeiter","NaturwissenschaftenProjektmitarbeiterallg_Psy","Vertrieb-Innendienst","allg_Psy"]
["Naturwissenschaften","Projektmitarbeiter","NaturwissenschaftenProjektmitarbeiterallg_Psy","Vertriebssteuerung","allg_Psy"]
["Naturwissenschaften","Trainee","NaturwissenschaftenTraineeallg_Psy","Account Management","allg_Psy"]
["Naturwissenschaften","Trainee","NaturwissenschaftenTraineeallg_Psy","Asset Management","allg_Psy"]
["Naturwissenschaften","Trainee","NaturwissenschaftenTraineeallg_Psy","Assistenz der Geschäftsleitung/ des Vorstands","allg_Psy"]
["Naturwissenschaften","Trainee","NaturwissenschaftenTraineeallg_Psy","Business Development","allg_Psy"]
["Naturwissenschaften","Trainee","NaturwissenschaftenTraineeallg_Psy","Consulting","allg_Psy"]
["Naturwissenschaften","Trainee","NaturwissenschaftenTraineeallg_Psy","Content Management","allg_Psy"]
["Naturwissenschaften","Trainee","NaturwissenschaftenTraineeallg_Psy","Controlling","allg_Psy"]
["Naturwissenschaften","Trainee","NaturwissenschaftenTraineeallg_Psy","Einkauf und Beschaffung","allg_Psy"]
["Naturwissenschaften","Trainee","NaturwissenschaftenTraineeallg_Psy","Engineering","allg_Psy"]
["Naturwissenschaften","Trainee","NaturwissenschaftenTraineeallg_Psy","Entwicklung","allg_Psy"]
["Naturwissenschaften","Trainee","NaturwissenschaftenTraineeallg_Psy","Finanzwesen","allg_Psy"]
["Naturwissenschaften","Trainee","NaturwissenschaftenTraineeallg_Psy","Forschung und Entwicklung","allg_Psy"]
["Naturwissenschaften","Trainee","NaturwissenschaftenTraineeallg_Psy","Gesundheitsmanagement","allg_Psy"]
["Naturwissenschaften","Trainee","NaturwissenschaftenTraineeallg_Psy","IT","allg_Psy"]
["Naturwissenschaften","Trainee","NaturwissenschaftenTraineeallg_Psy","IT-Consulting","allg_Psy"]
["Naturwissenschaften","Trainee","NaturwissenschaftenTraineeallg_Psy","Key Account Management","allg_Psy"]
["Naturwissenschaften","Trainee","NaturwissenschaftenTraineeallg_Psy","Konstruktion","allg_Psy"]
["Naturwissenschaften","Trainee","NaturwissenschaftenTraineeallg_Psy","Logistik","allg_Psy"]
["Naturwissenschaften","Trainee","NaturwissenschaftenTraineeallg_Psy","Marketing","allg_Psy"]
["Naturwissenschaften","Trainee","NaturwissenschaftenTraineeallg_Psy","Marktforschung","allg_Psy"]
["Naturwissenschaften","Trainee","NaturwissenschaftenTraineeallg_Psy","Online-Marketing","allg_Psy"]
["Naturwissenschaften","Trainee","NaturwissenschaftenTraineeallg_Psy","Personalwesen","allg_Psy"]
["Naturwissenschaften","Trainee","NaturwissenschaftenTraineeallg_Psy","Portfoliomanagement","allg_Psy"]
["Naturwissenschaften","Trainee","NaturwissenschaftenTraineeallg_Psy","Produktion und Fertigung","allg_Psy"]
["Naturwissenschaften","Trainee","NaturwissenschaftenTraineeallg_Psy","Produktmanagement","allg_Psy"]
["Naturwissenschaften","Trainee","NaturwissenschaftenTraineeallg_Psy","Projektmanagement","allg_Psy"]
["Naturwissenschaften","Trainee","NaturwissenschaftenTraineeallg_Psy","Prozessmanagement","allg_Psy"]
["Naturwissenschaften","Trainee","NaturwissenschaftenTraineeallg_Psy","Public Relation und Unternehmenskommunikation","allg_Psy"]
["Naturwissenschaften","Trainee","NaturwissenschaftenTraineeallg_Psy","Qualitätswesen","allg_Psy"]
["Naturwissenschaften","Trainee","NaturwissenschaftenTraineeallg_Psy","Redaktion","allg_Psy"]
["Naturwissenschaften","Trainee","NaturwissenschaftenTraineeallg_Psy","Softwareentwicklung","allg_Psy"]
["Naturwissenschaften","Trainee","NaturwissenschaftenTraineeallg_Psy","Sozialwesen","allg_Psy"]
["Naturwissenschaften","Trainee","NaturwissenschaftenTraineeallg_Psy","Strategieentwicklung","allg_Psy"]
["Naturwissenschaften","Trainee","NaturwissenschaftenTraineeallg_Psy","Strategisches Produktmanagement","allg_Psy"]
["Naturwissenschaften","Trainee","NaturwissenschaftenTraineeallg_Psy","Unternehmenskommunikation und Public Relation","allg_Psy"]
["Naturwissenschaften","Trainee","NaturwissenschaftenTraineeallg_Psy","Vertrieb-Außendienst","allg_Psy"]
["Naturwissenschaften","Trainee","NaturwissenschaftenTraineeallg_Psy","Vertrieb-Innendienst","allg_Psy"]
["Naturwissenschaften","Trainee","NaturwissenschaftenTraineeallg_Psy","Vertriebssteuerung","allg_Psy"]
["Naturwissenschaften","Controller","NaturwissenschaftenControllerMathe_Wmathe","Controlling","Mathe_Wmathe"]
["Naturwissenschaften","Controller","NaturwissenschaftenControllerMathe_Wmathe","Einkauf und Beschaffung","Mathe_Wmathe"]
["Naturwissenschaften","Controller","NaturwissenschaftenControllerMathe_Wmathe","Finanzwesen","Mathe_Wmathe"]
["Naturwissenschaften","Controller","NaturwissenschaftenControllerMathe_Wmathe","Produktion und Fertigung","Mathe_Wmathe"]
["Naturwissenschaften","Controller","NaturwissenschaftenControllerMathe_Wmathe","Rechnungswesen","Mathe_Wmathe"]
["Naturwissenschaften","Controller","NaturwissenschaftenControllerMathe_Wmathe","Risikomanagement","Mathe_Wmathe"]
["Naturwissenschaften","Controller","NaturwissenschaftenControllerMathe_Wmathe","Vertriebssteuerung","Mathe_Wmathe"]
["Naturwissenschaften","Mitarbeiter","NaturwissenschaftenMitarbeiterMathe_Wmathe","Account Management","Mathe_Wmathe"]
["Naturwissenschaften","Mitarbeiter","NaturwissenschaftenMitarbeiterMathe_Wmathe","Allgemeine Verwaltung","Mathe_Wmathe"]
["Naturwissenschaften","Mitarbeiter","NaturwissenschaftenMitarbeiterMathe_Wmathe","Asset Management","Mathe_Wmathe"]
["Naturwissenschaften","Mitarbeiter","NaturwissenschaftenMitarbeiterMathe_Wmathe","Assistenz der Geschäftsleitung/ des Vorstands","Mathe_Wmathe"]
["Naturwissenschaften","Mitarbeiter",{"$f":"A2117&B2117&E2117","v":"NaturwissenschaftenMitarbeiterMathe_Wmathe"},"Aus- und Weiterbildung","Mathe_Wmathe"]
["Naturwissenschaften","Mitarbeiter","NaturwissenschaftenMitarbeiterMathe_Wmathe","Business Development","Mathe_Wmathe"]
["Naturwissenschaften","Mitarbeiter","NaturwissenschaftenMitarbeiterMathe_Wmathe","Consulting","Mathe_Wmathe"]
["Naturwissenschaften","Mitarbeiter","NaturwissenschaftenMitarbeiterMathe_Wmathe","Content Management","Mathe_Wmathe"]
["Naturwissenschaften","Mitarbeiter","NaturwissenschaftenMitarbeiterMathe_Wmathe","Controlling","Mathe_Wmathe"]
["Naturwissenschaften","Mitarbeiter","NaturwissenschaftenMitarbeiterMathe_Wmathe","Einkauf und Beschaffung","Mathe_Wmathe"]
["Naturwissenschaften","Mitarbeiter","NaturwissenschaftenMitarbeiterMathe_Wmathe","Engineering","Mathe_Wmathe"]
["Naturwissenschaften","Mitarbeiter","NaturwissenschaftenMitarbeiterMathe_Wmathe","Entwicklung","Mathe_Wmathe"]
["Naturwissenschaften","Mitarbeiter","NaturwissenschaftenMitarbeiterMathe_Wmathe","Finanzwesen","Mathe_Wmathe"]
["Naturwissenschaften","Mitarbeiter","NaturwissenschaftenMitarbeiterMathe_Wmathe","Forschung und Entwicklung","Mathe_Wmathe"]
["Naturwissenschaften","Mitarbeiter","NaturwissenschaftenMitarbeiterMathe_Wmathe","Gesundheitsmanagement","Mathe_Wmathe"]
["Naturwissenschaften","Mitarbeiter","NaturwissenschaftenMitarbeiterMathe_Wmathe","IT","Mathe_Wmathe"]
["Naturwissenschaften","Mitarbeiter","NaturwissenschaftenMitarbeiterMathe_Wmathe","IT-Consulting","Mathe_Wmathe"]
["Naturwissenschaften","Mitarbeiter","NaturwissenschaftenMitarbeiterMathe_Wmathe","Key Account Management","Mathe_Wmathe"]
["Naturwissenschaften","Mitarbeiter","NaturwissenschaftenMitarbeiterMathe_Wmathe","Konstruktion","Mathe_Wmathe"]
["Naturwissenschaften","Mitarbeiter","NaturwissenschaftenMitarbeiterMathe_Wmathe","Logistik","Mathe_Wmathe"]
["Naturwissenschaften","Mitarbeiter","NaturwissenschaftenMitarbeiterMathe_Wmathe","Marketing","Mathe_Wmathe"]
["Naturwissenschaften","Mitarbeiter","NaturwissenschaftenMitarbeiterMathe_Wmathe","Marktforschung","Mathe_Wmathe"]
["Naturwissenschaften","Mitarbeiter","NaturwissenschaftenMitarbeiterMathe_Wmathe","Online-Marketing","Mathe_Wmathe"]
["Naturwissenschaften","Mitarbeiter","NaturwissenschaftenMitarbeiterMathe_Wmathe","Personalwesen","Mathe_Wmathe"]
["Naturwissenschaften","Mitarbeiter","NaturwissenschaftenMitarbeiterMathe_Wmathe","Planung","Mathe_Wmathe"]
["Naturwissenschaften","Mitarbeiter","NaturwissenschaftenMitarbeiterMathe_Wmathe","Portfoliomanagement","Mathe_Wmathe"]
["Naturwissenschaften","Mitarbeiter","NaturwissenschaftenMitarbeiterMathe_Wmathe","Produktion und Fertigung","Mathe_Wmathe"]
["Naturwissenschaften","Mitarbeiter","NaturwissenschaftenMitarbeiterMathe_Wmathe","Produktmanagement","Mathe_Wmathe"]
["Naturwissenschaften","Mitarbeiter","NaturwissenschaftenMitarbeiterMathe_Wmathe","Projektmanagement","Mathe_Wmathe"]
["Naturwissenschaften","Mitarbeiter","NaturwissenschaftenMitarbeiterMathe_Wmathe","Prozessmanagement","Mathe_Wmathe"]
["Naturwissenschaften","Mitarbeiter","NaturwissenschaftenMitarbeiterMathe_Wmathe","Public Relation und Unternehmenskommunikation","Mathe_Wmathe"]
["Naturwissenschaften","Mitarbeiter","NaturwissenschaftenMitarbeiterMathe_Wmathe","Qualitätswesen","Mathe_Wmathe"]
["Naturwissenschaften","Mitarbeiter","NaturwissenschaftenMitarbeiterMathe_Wmathe","Rechnungswesen","Mathe_Wmathe"]
["Naturwissenschaften","Mitarbeiter","NaturwissenschaftenMitarbeiterMathe_Wmathe","Redaktion","Mathe_Wmathe"]
["Naturwissenschaften","Mitarbeiter","NaturwissenschaftenMitarbeiterMathe_Wmathe","Risikomanagement","Mathe_Wmathe"]
["Naturwissenschaften","Mitarbeiter","NaturwissenschaftenMitarbeiterMathe_Wmathe","Softwareentwicklung","Mathe_Wmathe"]
["Naturwissenschaften","Mitarbeiter","NaturwissenschaftenMitarbeiterMathe_Wmathe","Strategieentwicklung","Mathe_Wmathe"]
["Naturwissenschaften","Mitarbeiter","NaturwissenschaftenMitarbeiterMathe_Wmathe","Strategisches Produktmanagement","Mathe_Wmathe"]
["Naturwissenschaften","Mitarbeiter","NaturwissenschaftenMitarbeiterMathe_Wmathe","Unternehmenskommunikation und Public Relation","Mathe_Wmathe"]
["Naturwissenschaften","Mitarbeiter","NaturwissenschaftenMitarbeiterMathe_Wmathe","Vertrieb-Außendienst","Mathe_Wmathe"]
["Naturwissenschaften","Mitarbeiter","NaturwissenschaftenMitarbeiterMathe_Wmathe","Vertrieb-Innendienst","Mathe_Wmathe"]
["Naturwissenschaften","Mitarbeiter","NaturwissenschaftenMitarbeiterMathe_Wmathe","Vertriebssteuerung","Mathe_Wmathe"]
["Naturwissenschaften","Projektleiter/_Projektmanager","NaturwissenschaftenProjektleiter/_ProjektmanagerMathe_Wmathe","Aus- und Weiterbildung","Mathe_Wmathe"]
["Naturwissenschaften","Projektleiter/_Projektmanager","NaturwissenschaftenProjektleiter/_ProjektmanagerMathe_Wmathe","Controlling","Mathe_Wmathe"]
["Naturwissenschaften","Projektleiter/_Projektmanager","NaturwissenschaftenProjektleiter/_ProjektmanagerMathe_Wmathe","Einkauf und Beschaffung","Mathe_Wmathe"]
["Naturwissenschaften","Projektleiter/_Projektmanager","NaturwissenschaftenProjektleiter/_ProjektmanagerMathe_Wmathe","Engineering","Mathe_Wmathe"]
["Naturwissenschaften","Projektleiter/_Projektmanager","NaturwissenschaftenProjektleiter/_ProjektmanagerMathe_Wmathe","Entwicklung","Mathe_Wmathe"]
["Naturwissenschaften","Projektleiter/_Projektmanager","NaturwissenschaftenProjektleiter/_ProjektmanagerMathe_Wmathe","Finanzwesen","Mathe_Wmathe"]
["Naturwissenschaften","Projektleiter/_Projektmanager","NaturwissenschaftenProjektleiter/_ProjektmanagerMathe_Wmathe","Forschung und Entwicklung","Mathe_Wmathe"]
["Naturwissenschaften","Projektleiter/_Projektmanager","NaturwissenschaftenProjektleiter/_ProjektmanagerMathe_Wmathe","Gesundheitsmanagement","Mathe_Wmathe"]
["Naturwissenschaften","Projektleiter/_Projektmanager","NaturwissenschaftenProjektleiter/_ProjektmanagerMathe_Wmathe","IT","Mathe_Wmathe"]
["Naturwissenschaften","Projektleiter/_Projektmanager","NaturwissenschaftenProjektleiter/_ProjektmanagerMathe_Wmathe","IT-Consulting","Mathe_Wmathe"]
["Naturwissenschaften","Projektleiter/_Projektmanager","NaturwissenschaftenProjektleiter/_ProjektmanagerMathe_Wmathe","Konstruktion","Mathe_Wmathe"]
["Naturwissenschaften","Projektleiter/_Projektmanager","NaturwissenschaftenProjektleiter/_ProjektmanagerMathe_Wmathe","Logistik","Mathe_Wmathe"]
["Naturwissenschaften","Projektleiter/_Projektmanager","NaturwissenschaftenProjektleiter/_ProjektmanagerMathe_Wmathe","Marketing","Mathe_Wmathe"]
["Naturwissenschaften","Projektleiter/_Projektmanager","NaturwissenschaftenProjektleiter/_ProjektmanagerMathe_Wmathe","Marktforschung","Mathe_Wmathe"]
["Naturwissenschaften","Projektleiter/_Projektmanager","NaturwissenschaftenProjektleiter/_ProjektmanagerMathe_Wmathe","Online-Marketing","Mathe_Wmathe"]
["Naturwissenschaften","Projektleiter/_Projektmanager","NaturwissenschaftenProjektleiter/_ProjektmanagerMathe_Wmathe","Personalwesen","Mathe_Wmathe"]
["Naturwissenschaften","Projektleiter/_Projektmanager","NaturwissenschaftenProjektleiter/_ProjektmanagerMathe_Wmathe","Planung","Mathe_Wmathe"]
["Naturwissenschaften","Projektleiter/_Projektmanager","NaturwissenschaftenProjektleiter/_ProjektmanagerMathe_Wmathe","Produktion und Fertigung","Mathe_Wmathe"]
["Naturwissenschaften","Projektleiter/_Projektmanager","NaturwissenschaftenProjektleiter/_ProjektmanagerMathe_Wmathe","Projektmanagement","Mathe_Wmathe"]
["Naturwissenschaften","Projektleiter/_Projektmanager","NaturwissenschaftenProjektleiter/_ProjektmanagerMathe_Wmathe","Public Relation und Unternehmenskommunikation","Mathe_Wmathe"]
["Naturwissenschaften","Projektleiter/_Projektmanager","NaturwissenschaftenProjektleiter/_ProjektmanagerMathe_Wmathe","Qualitätswesen","Mathe_Wmathe"]
["Naturwissenschaften","Projektleiter/_Projektmanager","NaturwissenschaftenProjektleiter/_ProjektmanagerMathe_Wmathe","Rechnungswesen","Mathe_Wmathe"]
["Naturwissenschaften","Projektleiter/_Projektmanager","NaturwissenschaftenProjektleiter/_ProjektmanagerMathe_Wmathe","Risikomanagement","Mathe_Wmathe"]
["Naturwissenschaften","Projektleiter/_Projektmanager","NaturwissenschaftenProjektleiter/_ProjektmanagerMathe_Wmathe","Softwareentwicklung","Mathe_Wmathe"]
["Naturwissenschaften","Projektleiter/_Projektmanager","NaturwissenschaftenProjektleiter/_ProjektmanagerMathe_Wmathe","Unternehmenskommunikation und Public Relation","Mathe_Wmathe"]
["Naturwissenschaften","Projektleiter/_Projektmanager","NaturwissenschaftenProjektleiter/_ProjektmanagerMathe_Wmathe","Vertrieb-Innendienst","Mathe_Wmathe"]
["Naturwissenschaften","Projektleiter/_Projektmanager",{"$f":"A2181&B2181&E2181","v":"NaturwissenschaftenProjektleiter/_ProjektmanagerMathe_Wmathe"},"Vertriebssteuerung","Mathe_Wmathe"]
["Naturwissenschaften","Projektmitarbeiter","NaturwissenschaftenProjektmitarbeiterMathe_Wmathe","Account Management","Mathe_Wmathe"]
["Naturwissenschaften","Projektmitarbeiter","NaturwissenschaftenProjektmitarbeiterMathe_Wmathe","Allgemeine Verwaltung","Mathe_Wmathe"]
["Naturwissenschaften","Projektmitarbeiter","NaturwissenschaftenProjektmitarbeiterMathe_Wmathe","Asset Management","Mathe_Wmathe"]
["Naturwissenschaften","Projektmitarbeiter","NaturwissenschaftenProjektmitarbeiterMathe_Wmathe","Assistenz der Geschäftsleitung/ des Vorstands","Mathe_Wmathe"]
["Naturwissenschaften","Projektmitarbeiter","NaturwissenschaftenProjektmitarbeiterMathe_Wmathe","Aus- und Weiterbildung","Mathe_Wmathe"]
["Naturwissenschaften","Projektmitarbeiter","NaturwissenschaftenProjektmitarbeiterMathe_Wmathe","Business Development","Mathe_Wmathe"]
["Naturwissenschaften","Projektmitarbeiter","NaturwissenschaftenProjektmitarbeiterMathe_Wmathe","Consulting","Mathe_Wmathe"]
["Naturwissenschaften","Projektmitarbeiter","NaturwissenschaftenProjektmitarbeiterMathe_Wmathe","Content Management","Mathe_Wmathe"]
["Naturwissenschaften","Projektmitarbeiter","NaturwissenschaftenProjektmitarbeiterMathe_Wmathe","Controlling","Mathe_Wmathe"]
["Naturwissenschaften","Projektmitarbeiter","NaturwissenschaftenProjektmitarbeiterMathe_Wmathe","Einkauf und Beschaffung","Mathe_Wmathe"]
["Naturwissenschaften","Projektmitarbeiter","NaturwissenschaftenProjektmitarbeiterMathe_Wmathe","Engineering","Mathe_Wmathe"]
["Naturwissenschaften","Projektmitarbeiter","NaturwissenschaftenProjektmitarbeiterMathe_Wmathe","Entwicklung","Mathe_Wmathe"]
["Naturwissenschaften","Projektmitarbeiter","NaturwissenschaftenProjektmitarbeiterMathe_Wmathe","Finanzwesen","Mathe_Wmathe"]
["Naturwissenschaften","Projektmitarbeiter","NaturwissenschaftenProjektmitarbeiterMathe_Wmathe","Forschung und Entwicklung","Mathe_Wmathe"]
["Naturwissenschaften","Projektmitarbeiter","NaturwissenschaftenProjektmitarbeiterMathe_Wmathe","Gesundheitsmanagement","Mathe_Wmathe"]
["Naturwissenschaften","Projektmitarbeiter","NaturwissenschaftenProjektmitarbeiterMathe_Wmathe","IT","Mathe_Wmathe"]
["Naturwissenschaften","Projektmitarbeiter","NaturwissenschaftenProjektmitarbeiterMathe_Wmathe","IT-Consulting","Mathe_Wmathe"]
["Naturwissenschaften","Projektmitarbeiter","NaturwissenschaftenProjektmitarbeiterMathe_Wmathe","Key Account Management","Mathe_Wmathe"]
["Naturwissenschaften","Projektmitarbeiter","NaturwissenschaftenProjektmitarbeiterMathe_Wmathe","Konstruktion","Mathe_Wmathe"]
["Naturwissenschaften","Projektmitarbeiter","NaturwissenschaftenProjektmitarbeiterMathe_Wmathe","Logistik","Mathe_Wmathe"]
["Naturwissenschaften","Projektmitarbeiter","NaturwissenschaftenProjektmitarbeiterMathe_Wmathe","Marketing","Mathe_Wmathe"]
["Naturwissenschaften","Projektmitarbeiter","NaturwissenschaftenProjektmitarbeiterMathe_Wmathe","Marktforschung","Mathe_Wmathe"]
["Naturwissenschaften","Projektmitarbeiter","NaturwissenschaftenProjektmitarbeiterMathe_Wmathe","Online-Marketing","Mathe_Wmathe"]
["Naturwissenschaften","Projektmitarbeiter","NaturwissenschaftenProjektmitarbeiterMathe_Wmathe","Personalwesen","Mathe_Wmathe"]
["Naturwissenschaften","Projektmitarbeiter","NaturwissenschaftenProjektmitarbeiterMathe_Wmathe","Planung","Mathe_Wmathe"]
["Naturwissenschaften","Projektmitarbeiter","NaturwissenschaftenProjektmitarbeiterMathe_Wmathe","Portfoliomanagement","Mathe_Wmathe"]
["Naturwissenschaften","Projektmitarbeiter","NaturwissenschaftenProjektmitarbeiterMathe_Wmathe","Produktion und Fertigung","Mathe_Wmathe"]
["Naturwissenschaften","Projektmitarbeiter","NaturwissenschaftenProjektmitarbeiterMathe_Wmathe","Produktmanagement","Mathe_Wmathe"]
["Naturwissenschaften","Projektmitarbeiter","NaturwissenschaftenProjektmitarbeiterMathe_Wmathe","Projektmanagement","Mathe_Wmathe"]
["Naturwissenschaften","Projektmitarbeiter","NaturwissenschaftenProjektmitarbeiterMathe_Wmathe","Prozessmanagement","Mathe_Wmathe"]
["Naturwissenschaften","Projektmitarbeiter","NaturwissenschaftenProjektmitarbeiterMathe_Wmathe","Public Relation und Unternehmenskommunikation","Mathe_Wmathe"]
["Naturwissenschaften","Projektmitarbeiter","NaturwissenschaftenProjektmitarbeiterMathe_Wmathe","Qualitätswesen","Mathe_Wmathe"]
["Naturwissenschaften","Projektmitarbeiter","NaturwissenschaftenProjektmitarbeiterMathe_Wmathe","Rechnungswesen","Mathe_Wmathe"]
["Naturwissenschaften","Projektmitarbeiter","NaturwissenschaftenProjektmitarbeiterMathe_Wmathe","Redaktion","Mathe_Wmathe"]
["Naturwissenschaften","Projektmitarbeiter","NaturwissenschaftenProjektmitarbeiterMathe_Wmathe","Risikomanagement","Mathe_Wmathe"]
["Naturwissenschaften","Projektmitarbeiter","NaturwissenschaftenProjektmitarbeiterMathe_Wmathe","Softwareentwicklung","Mathe_Wmathe"]
["Naturwissenschaften","Projektmitarbeiter","NaturwissenschaftenProjektmitarbeiterMathe_Wmathe","Strategieentwicklung","Mathe_Wmathe"]
["Naturwissenschaften","Projektmitarbeiter","NaturwissenschaftenProjektmitarbeiterMathe_Wmathe","Strategisches Produktmanagement","Mathe_Wmathe"]
["Naturwissenschaften","Projektmitarbeiter","NaturwissenschaftenProjektmitarbeiterMathe_Wmathe","Unternehmenskommunikation und Public Relation","Mathe_Wmathe"]
["Naturwissenschaften","Projektmitarbeiter","NaturwissenschaftenProjektmitarbeiterMathe_Wmathe","Vertrieb-Außendienst","Mathe_Wmathe"]
["Naturwissenschaften","Projektmitarbeiter","NaturwissenschaftenProjektmitarbeiterMathe_Wmathe","Vertrieb-Innendienst","Mathe_Wmathe"]
["Naturwissenschaften","Projektmitarbeiter","NaturwissenschaftenProjektmitarbeiterMathe_Wmathe","Vertriebssteuerung","Mathe_Wmathe"]
["Naturwissenschaften","Prüfungsassistent","NaturwissenschaftenPrüfungsassistentMathe_Wmathe","Content Management","Mathe_Wmathe"]
["Naturwissenschaften","Prüfungsassistent","NaturwissenschaftenPrüfungsassistentMathe_Wmathe","Controlling","Mathe_Wmathe"]
["Naturwissenschaften","Prüfungsassistent","NaturwissenschaftenPrüfungsassistentMathe_Wmathe","Einkauf und Beschaffung","Mathe_Wmathe"]
["Naturwissenschaften","Prüfungsassistent","NaturwissenschaftenPrüfungsassistentMathe_Wmathe","Engineering","Mathe_Wmathe"]
["Naturwissenschaften","Prüfungsassistent","NaturwissenschaftenPrüfungsassistentMathe_Wmathe","Entwicklung","Mathe_Wmathe"]
["Naturwissenschaften","Prüfungsassistent","NaturwissenschaftenPrüfungsassistentMathe_Wmathe","Finanzwesen","Mathe_Wmathe"]
["Naturwissenschaften","Prüfungsassistent","NaturwissenschaftenPrüfungsassistentMathe_Wmathe","Gesundheitsmanagement","Mathe_Wmathe"]
["Naturwissenschaften","Prüfungsassistent","NaturwissenschaftenPrüfungsassistentMathe_Wmathe","Konstruktion","Mathe_Wmathe"]
["Naturwissenschaften","Prüfungsassistent","NaturwissenschaftenPrüfungsassistentMathe_Wmathe","Logistik","Mathe_Wmathe"]
["Naturwissenschaften","Prüfungsassistent","NaturwissenschaftenPrüfungsassistentMathe_Wmathe","Portfoliomanagement","Mathe_Wmathe"]
["Naturwissenschaften","Prüfungsassistent","NaturwissenschaftenPrüfungsassistentMathe_Wmathe","Produktion und Fertigung","Mathe_Wmathe"]
["Naturwissenschaften","Prüfungsassistent","NaturwissenschaftenPrüfungsassistentMathe_Wmathe","Prozessmanagement","Mathe_Wmathe"]
["Naturwissenschaften","Prüfungsassistent","NaturwissenschaftenPrüfungsassistentMathe_Wmathe","Qualitätswesen","Mathe_Wmathe"]
["Naturwissenschaften","Prüfungsassistent","NaturwissenschaftenPrüfungsassistentMathe_Wmathe","Rechnungswesen","Mathe_Wmathe"]
["Naturwissenschaften","Prüfungsassistent","NaturwissenschaftenPrüfungsassistentMathe_Wmathe","Risikomanagement","Mathe_Wmathe"]
["Naturwissenschaften","Referent","NaturwissenschaftenReferentMathe_Wmathe","Aus- und Weiterbildung","Mathe_Wmathe"]
["Naturwissenschaften","Referent","NaturwissenschaftenReferentMathe_Wmathe","Controlling","Mathe_Wmathe"]
["Naturwissenschaften","Referent","NaturwissenschaftenReferentMathe_Wmathe","Finanzwesen","Mathe_Wmathe"]
["Naturwissenschaften","Referent","NaturwissenschaftenReferentMathe_Wmathe","Gesundheitsmanagement","Mathe_Wmathe"]
["Naturwissenschaften","Referent","NaturwissenschaftenReferentMathe_Wmathe","Marketing","Mathe_Wmathe"]
["Naturwissenschaften","Referent","NaturwissenschaftenReferentMathe_Wmathe","Personalwesen","Mathe_Wmathe"]
["Naturwissenschaften","Referent",{"$f":"A2245&B2245&E2245","v":"NaturwissenschaftenReferentMathe_Wmathe"},"Public Relation und Unternehmenskommunikation","Mathe_Wmathe"]
["Naturwissenschaften","Referent","NaturwissenschaftenReferentMathe_Wmathe","Rechnungswesen","Mathe_Wmathe"]
["Naturwissenschaften","Referent","NaturwissenschaftenReferentMathe_Wmathe","Unternehmenskommunikation und Public Relation","Mathe_Wmathe"]
["Naturwissenschaften","Trainee","NaturwissenschaftenTraineeMathe_Wmathe","Account Management","Mathe_Wmathe"]
["Naturwissenschaften","Trainee","NaturwissenschaftenTraineeMathe_Wmathe","Asset Management","Mathe_Wmathe"]
["Naturwissenschaften","Trainee","NaturwissenschaftenTraineeMathe_Wmathe","Assistenz der Geschäftsleitung/ des Vorstands","Mathe_Wmathe"]
["Naturwissenschaften","Trainee","NaturwissenschaftenTraineeMathe_Wmathe","Business Development","Mathe_Wmathe"]
["Naturwissenschaften","Trainee","NaturwissenschaftenTraineeMathe_Wmathe","Consulting","Mathe_Wmathe"]
["Naturwissenschaften","Trainee","NaturwissenschaftenTraineeMathe_Wmathe","Content Management","Mathe_Wmathe"]
["Naturwissenschaften","Trainee","NaturwissenschaftenTraineeMathe_Wmathe","Controlling","Mathe_Wmathe"]
["Naturwissenschaften","Trainee","NaturwissenschaftenTraineeMathe_Wmathe","Einkauf und Beschaffung","Mathe_Wmathe"]
["Naturwissenschaften","Trainee","NaturwissenschaftenTraineeMathe_Wmathe","Engineering","Mathe_Wmathe"]
["Naturwissenschaften","Trainee","NaturwissenschaftenTraineeMathe_Wmathe","Entwicklung","Mathe_Wmathe"]
["Naturwissenschaften","Trainee","NaturwissenschaftenTraineeMathe_Wmathe","Finanzwesen","Mathe_Wmathe"]
["Naturwissenschaften","Trainee","NaturwissenschaftenTraineeMathe_Wmathe","Forschung und Entwicklung","Mathe_Wmathe"]
["Naturwissenschaften","Trainee","NaturwissenschaftenTraineeMathe_Wmathe","Gesundheitsmanagement","Mathe_Wmathe"]
["Naturwissenschaften","Trainee","NaturwissenschaftenTraineeMathe_Wmathe","IT","Mathe_Wmathe"]
["Naturwissenschaften","Trainee","NaturwissenschaftenTraineeMathe_Wmathe","IT-Consulting","Mathe_Wmathe"]
["Naturwissenschaften","Trainee","NaturwissenschaftenTraineeMathe_Wmathe","Key Account Management","Mathe_Wmathe"]
["Naturwissenschaften","Trainee","NaturwissenschaftenTraineeMathe_Wmathe","Konstruktion","Mathe_Wmathe"]
["Naturwissenschaften","Trainee","NaturwissenschaftenTraineeMathe_Wmathe","Logistik","Mathe_Wmathe"]
["Naturwissenschaften","Trainee","NaturwissenschaftenTraineeMathe_Wmathe","Marketing","Mathe_Wmathe"]
["Naturwissenschaften","Trainee","NaturwissenschaftenTraineeMathe_Wmathe","Marktforschung","Mathe_Wmathe"]
["Naturwissenschaften","Trainee","NaturwissenschaftenTraineeMathe_Wmathe","Online-Marketing","Mathe_Wmathe"]
["Naturwissenschaften","Trainee","NaturwissenschaftenTraineeMathe_Wmathe","Personalwesen","Mathe_Wmathe"]
["Naturwissenschaften","Trainee","NaturwissenschaftenTraineeMathe_Wmathe","Portfoliomanagement","Mathe_Wmathe"]
["Naturwissenschaften","Trainee","NaturwissenschaftenTraineeMathe_Wmathe","Produktion und Fertigung","Mathe_Wmathe"]
["Naturwissenschaften","Trainee","NaturwissenschaftenTraineeMathe_Wmathe","Produktmanagement","Mathe_Wmathe"]
["Naturwissenschaften","Trainee","NaturwissenschaftenTraineeMathe_Wmathe","Projektmanagement","Mathe_Wmathe"]
["Naturwissenschaften","Trainee","NaturwissenschaftenTraineeMathe_Wmathe","Prozessmanagement","Mathe_Wmathe"]
["Naturwissenschaften","Trainee","NaturwissenschaftenTraineeMathe_Wmathe","Public Relation und Unternehmenskommunikation","Mathe_Wmathe"]
["Naturwissenschaften","Trainee","NaturwissenschaftenTraineeMathe_Wmathe","Qualitätswesen","Mathe_Wmathe"]
["Naturwissenschaften","Trainee","NaturwissenschaftenTraineeMathe_Wmathe","Rechnungswesen","Mathe_Wmathe"]
["Naturwissenschaften","Trainee","NaturwissenschaftenTraineeMathe_Wmathe","Redaktion","Mathe_Wmathe"]
["Naturwissenschaften","Trainee","NaturwissenschaftenTraineeMathe_Wmathe","Risikomanagement","Mathe_Wmathe"]
["Naturwissenschaften","Trainee","NaturwissenschaftenTraineeMathe_Wmathe","Softwareentwicklung","Mathe_Wmathe"]
["Naturwissenschaften","Trainee","NaturwissenschaftenTraineeMathe_Wmathe","Strategieentwicklung","Mathe_Wmathe"]
["Naturwissenschaften","Trainee","NaturwissenschaftenTraineeMathe_Wmathe","Strategisches Produktmanagement","Mathe_Wmathe"]
["Naturwissenschaften","Trainee","NaturwissenschaftenTraineeMathe_Wmathe","Unternehmenskommunikation und Public Relation","Mathe_Wmathe"]
["Naturwissenschaften","Trainee","NaturwissenschaftenTraineeMathe_Wmathe","Vertrieb-Außendienst","Mathe_Wmathe"]
["Naturwissenschaften","Trainee","NaturwissenschaftenTraineeMathe_Wmathe","Vertrieb-Innendienst","Mathe_Wmathe"]
["Naturwissenschaften","Trainee","NaturwissenschaftenTraineeMathe_Wmathe","Vertriebssteuerung","Mathe_Wmathe"]

{"sheet":"Aufschlüsselung","index":9,"n_rows":506,"n_cols":65,"rows_kept":506,"cut":false,"hidden":true,"merged":[]}
["Spalte","Listen",null,"Karrierephase","Code",null,"Land"," Codes \nLand ","Sprachen","Codes \nSprachen","Sprachkenntnisse","Codes \nSprachk.","Land_Praktika",null,"Hochschulart","Codes \nHS-Art","Abschluss","Codes \nAbschluss","Fachbereich","Codes\nFB","Studiengang","Codes\nSG",null,"Branche","Codes\nBranche","Standort","Unternehmensgröße",null,"Position für Codes","Code",null,"Geistes_und_SozialwissenschaftenPos",null,"InformatikPos",null,"IngenieurwissenschaftenPos",null,null,null,null,null,"NaturwissenschaftenPos",null,"RechtswissenschaftenPos",null,null,null,"WirtschaftsinformatikPos",null,"WirtschaftsingenieurwesenPos",null,"WirtschaftswissenschaftenPos",null,null,null,null,"TB für Codes","Code",null,"NaturwissenschaftenPosPromotion","NaturwissenschaftenPosMathematik_Wmathe","NaturwissenschaftenPosPsychologie","IngenieurwissenschaftenPosBauleiter","Hochschulort","Code"]
[null,null,null,"Student",1,null," - Bitte auswählen -",{"$f":"\"\"","v":""}," - Bitte auswählen -",{"$f":"\"\"","v":""}," - Bitte auswählen -",6," - Bitte auswählen -",null," - Bitte auswählen -",0," - Bitte auswählen -",10," - Bitte auswählen -",0,"Geistes_und_Sozialwissenschaften",null,null," - Bitte auswählen -",{"$f":"\"\"","v":""}," - Bitte auswählen -"," - Bitte auswählen -",null,"Account_Manager","2",null," - Bitte auswählen -",null," - Bitte auswählen -",null," - Bitte auswählen -",null,null,null,null,null," - Bitte auswählen -",null," - Bitte auswählen -",null,null,null," - Bitte auswählen -",null," - Bitte auswählen -",null," - Bitte auswählen -",null,null,null,null,"Account Management",138,null," - Bitte auswählen -"," - Bitte auswählen -"," - Bitte auswählen -"," - Bitte auswählen -","Aachen","0"]
["D1","Allgemein",null,"Absolvent",2,null,"Afghanistan","1","Afrikaans","1","Muttersprache",1,"Ausland",null,"BA/ Duale Hochschule",1,"Bachelor",0,"Geistes_und_Sozialwissenschaften",1,"Geistes_und_Sozialwissenschaften allgemein",1906,null,"Agrarwirtschaft","0","Baden-Württemberg","1 - 50 Mitarbeiter",null,"Analyst","62",null,"Account_Manager",null,"Account_Manager",null,"Account_Manager",null,null,null,null,null,"Account_Manager",null,"Account_Manager",null,null,null,"Account_Manager",null,"Account_Manager",null,"Account_Manager",null,null,null,null,"Allgemeine Verwaltung","67",null,"Account_Manager","Account_Manager","Account_Manager","Account_Manager","Aalen","1"]
["D1","Karrierephase",null,null,null,null,"Ägypten","2","Albanisch","2","Verhandlungssicher",2,"Baden-Württemberg",null,"Fachhochschule",2,"Diplom-BA/DH",1,"Informatik",2,"Psychologie","1746",null,"Anlagenbau","1","Bayern","51 - 100 Mitarbeiter",null,"Asset_Manager",65,null,"Assistent_der_Geschäftsleitung/_des_Vorstands",null,"Assistent_der_Geschäftsleitung/_des_Vorstands",null,"Assistent_der_Geschäftsleitung/_des_Vorstands",null,null,null,null,null,"Assistent_der_Geschäftsleitung/_des_Vorstands",null,"Assistent_der_Geschäftsleitung/_des_Vorstands",null,null,null,"Analyst",null,"Analyst",null,"Analyst",null,null,null,null,"Asset Management","85",null,"Assistent_der_Geschäftsleitung/_des_Vorstands","Analyst","Assistent_der_Geschäftsleitung/_des_Vorstands","Assistent_der_Geschäftsleitung/_des_Vorstands","Aarau","2"]
["D6","Tätigkeitsstatus",null,null,null,null,"Albanien","3","Arabisch","3","Fließend in Wort und Schrift",3,"Bayern",null,"Hochschule",2,"Diplom-FH",1,"Ingenieurwissenschaften",3,"Soziologie","1909",null,"Architekturbüro","2","Berlin","101 - 500 Mitarbeiter",null,"Assistent_der_Geschäftsleitung/_des_Vorstands",3,null,"Associate",null,"Associate",null,"Associate",null,null,null,null,null,"Associate",null,"Associate",null,null,null,"Asset_Manager",null,"Asset_Manager",null,"Asset_Manager",null,null,null,null,"Assistenz der Geschäftsleitung/ des Vorstands",126,null,"Associate","Asset_Manager","Associate","Associate","Aargau","3"]
["D11","Cust Group",null,"Tätigkeitsstatus","Code",null,"Algerien","4","Aramäisch","4","Weiterentwickelte Kenntnisse",4,"Berlin",null,"Kunsthochschule",3,"Diplom-Uni",1,"Naturwissenschaften",4,null,null,null,"Automatisierungstechnik","109","Brandenburg","501 - 1000 Mitarbeiter",null,"Associate","5",null,"Business_Development_Manager",null,"Business_Development_Manager",null,"Business_Development_Manager",null,null,null,null,null,"Business_Development_Manager",null,"Business_Development_Manager",null,null,null,"Assistent_der_Geschäftsleitung/_des_Vorstands",null,"Assistent_der_Geschäftsleitung/_des_Vorstands",null,"Assistent_der_Geschäftsleitung/_des_Vorstands",null,null,null,null,"Aus- und Weiterbildung",1,null,"Business_Development_Manager","Assistent_der_Geschäftsleitung/_des_Vorstands","Business_Development_Manager","Bauleiter","Aberdeen","4"]
["D17","Ausbildungsart",null,"unbekannt",9,null,"Andorra","5","Armenisch","5","Grundkenntnisse",5,"Brandenburg",null,"Private Hochschule",9,"Diplom-VWA",1,"Rechtswissenschaften",5,"Informatik",null,null,"Automobilindustrie","4","Bremen","1001 - 5000 Mitarbeiter",null,"Bauleiter","67",null,"Consultant",null,"Consultant",null,"Consultant",null,null,null,null,null,"Consultant",null,"Consultant",null,null,null,"Associate",null,"Associate",null,"Associate",null,null,null,null,"Bauleitung",41,null,"Consultant","Associate","Consultant","Business_Development_Manager","Achenbach","5"]
["D24","Bitte_auswählen",null,"Student",10,null,"Angola","6","Aserbaidschanisch","6",0,6,"Bremen",null,"Private Universität",10,"Magister",5,"Wirtschaftsinformatik",14,"Informatik allgemein",896,null,"Automobilzulieferer","5","Düsseldorf"," >5000 Mitarbeiter",null,"Business_Development_Manager","94",null,"Content_Manager",null,"Content_Manager",null,"Content_Manager",null,null,null,null,null,"Content_Manager",null,"Content_Manager",null,null,null,"Business_Development_Manager",null,"Bauleiter",null,"Business_Development_Manager",null,null,null,null,"Business Development","86",null,"Content_Manager","Business_Development_Manager","Content_Manager","Consultant","Ahrensburg","6"]
["D28","Anwort/ SG/ TB/ Pos",null,null,null,null,"Antigua und Barbuda","7","Bahasa Indonesia","7","kein Eintrag",6,"Dortmund",null,"Technische Fachhochschule",5,"Master",6,"Wirtschaftsingenieurwesen",13,"Medizinische Informatik","1429",null,"Banken","6","Frankfurt am Main",null,null,"Consultant","9",null,"Controller",null,"Controller",null,"Controller",null,null,null,null,null,"Controller",null,"Controller",null,null,null,"Consultant",null,"Business_Development_Manager",null,"Consultant",null,null,null,null,"Consulting","4",null,"Controller","Consultant","Controller","Content_Manager","Albstadt","7"]
[null,null,null,null,null,null,"Äquatorialguinea","8","Birmanisch","8",null,null,"Dresden",null,"Technische Hochschule",5,"Erstes Staatsexamen",2,"Wirtschaftswissenschaften",7,null,null,null,"Baugewerbe","7","Hamburg","Ungröße für vier Branchen: Architekturbüro, Kanzleien und Rechtsanwälte, Bauingenieurbüro, Steuerberatung und Wirtschaftsprüfung/ Wirtschaftsprüfung und Steuerberatung",null,"Content_Manager","8",null,"Einkäufer",null,"Einkäufer",null,"Einkäufer",null,null,null,null,null,"Einkäufer",null,"Justiziar/_Syndikus",null,null,null,"Content_Manager",null,"Consultant",null,"Content_Manager",null,null,null,null,"Content Management","5",null,"Einkäufer","Content_Manager","Einkäufer","Controller","Alfeld","8"]
["D33","Ausbildung",null,"Cust Group","Code",null,"Argentinien","9","Bulgarisch","9",null,null,"Düsseldorf",null,"Technische Universität",6,"Zweites Staatsexamen",9,"kein","0","Ingenieurwissenschaften",null,null,"Bauingenieurbüro","8","Hannover","Ungröße_Branche",null,"Controller","69",null,"Event_Manager",null,"Entwickler",null,"Entwickler",null,null,null,null,null,"Entwickler",null,"Kaufmännischer_Angestellter",null,null,null,"Controller",null,"Content_Manager",null,"Controller",null,null,null,null,"Controlling","6",null,"Entwickler","Controller","Entwickler","Einkäufer","Amberg","9"]
[null,"Geschlecht",null,"Kunde",1,null,"Armenien","10","Chinesisch","10",null,null,"Frankfurt am Main",null,"Universität",7,"Drittes Staatsexamen",11,null,null,"Ingenieurwissenschaften allgemein",953,null,"Bildungsinstitutionen/-wesen","11","Hessen","1 - 10 Mitarbeiter",null,"Einkäufer",101,null,"Key_Account_Manager",null,"Key_Account_Manager",null,"Key_Account_Manager",null,null,null,null,null,"Key_Account_Manager",null,"Key_Account_Manager",null,null,null,"Einkäufer",null,"Controller",null,"Einkäufer",null,null,null,null,"Design und Gestaltung","87",null,"Key_Account_Manager","Einkäufer","Key_Account_Manager","Entwickler","Amsterdam","10"]
[null,"MLP-Kunde",null,"bereits Interessent",2,null,"Aserbaidschan","11","Dänisch","11",null,null,"Hamburg",null,"Verwaltungsakademie",8,"Promotion",8,null,null,"Architektur","122",null,"Bio- und Gentechnologie",133,"Mecklenburg-Vorpommern","10 - 25 Mitarbeiter",null,"Entwickler","72",null,"Marketing_Assistent",null,"Konstrukteur",null,"Konstrukteur",null,null,null,null,null,"Konstrukteur",null,"Mitarbeiter",null,null,null,"Entwickler",null,"Einkäufer",null,"Event_Manager",null,null,null,null,"Einkauf und Beschaffung","12",null,"Konstrukteur","Entwickler","Konstrukteur","Key_Account_Manager","Ancona","11"]
[null,"Promotionsbewertung",null,null,null,null,"Äthiopien","12","Deutsch","12",null,null,"Hannover",null,"Keine",0,"unbekannt",10,null,null,"Automatisierungstechnik",146,null,"Chemie","14","München","25 - 50 Mitarbeiter",null,"Event_Manager","11",null,"Mitarbeiter",null,"Mitarbeiter",null,"Mitarbeiter",null,null,null,null,null,"Mitarbeiter",null,"Personalreferent",null,null,null,"Event_Manager",null,"Entwickler",null,"Kaufmännischer_Angestellter",null,null,null,null,"Engineering","89",null,"Laborleiter","Key_Account_Manager","Mitarbeiter","Konstrukteur","Andernach","12"]
[null,"Doppel- bzw. Zweitstudium",null,null,null,null,"Australien","13","Englisch","13",null,null,"Hessen",null,"Sonstige",4,"kein Abschluss",4,null,null,"Bauingenieurwesen","175",null,"Consulting","15","Niedersachsen","50 - 100 Mitarbeiter",null,"Justiziar/_Syndikus",103,null,"Personalreferent",null,"Produkt_Manager",null,"Produkt_Manager",null,null,null,null,null,"Pharmareferent",null,"Projektleiter/_Projektmanager",null,null,null,"Kaufmännischer_Angestellter",null,"Event_Manager",null,"Key_Account_Manager",null,null,null,null,"Entwicklung","13",null,"Mitarbeiter","Konstrukteur","Personalreferent","Mitarbeiter","Ansbach","13"]
[null,null,null,null,null,null,"Bahamas","14","Finnisch","14",null,null,"Mecklenburg-Vorpommern",null,null,null,"nicht akademisch",7,null,null,"Biotechnologie","251",null,"Dienstleistungen","16","Nordrhein-Westfalen","100 - 500 Mitarbeiter",null,"Kaufmännischer_Angestellter","18",null,"Produkt_Manager",null,"Projektingenieur",null,"Projektingenieur",null,null,null,null,null,"Produkt_Manager",null,"Projektmitarbeiter",null,null,null,"Key_Account_Manager",null,"Kaufmännischer_Angestellter",null,"Marketing_Assistent",null,null,null,null,"Event Management","14",null,"Pharmareferent","Mitarbeiter","Pharmareferent","Produkt_Manager","Aschaffenburg","14"]
["G","Qualifikation",null,"Ausbildungsart","Code",null,"Bahrain","15","Französisch","15",null,null,"München",null,null,null,null,null,null,null,"Chemieingenieurwesen","306",null,"Druckbranche","17","Rheinland-Pfalz",">500 Mitarbeiter",null,"Key_Account_Manager","19",null,"Projektleiter/_Projektmanager",null,"Projektleiter/_Projektmanager",null,"Projektleiter/_Projektmanager",null,null,null,null,null,"Projektingenieur",null,"Prozessmanager",null,null,null,"Konstrukteur",null,"Key_Account_Manager",null,"Mitarbeiter",null,null,null,null,"Facility Management",129,null,"Produkt_Manager","Pharmareferent","Produkt_Manager","Projektingenieur","Aue","15"]
["G","Land",null,"akademisch",1,null,"Bangladesch","16","Georgisch ","16",null,null,"Niedersachsen",null,null,null,null,null,null,null,"Elektrotechnik","459",null,"Einzelhandel","18","Saarland",null,null,"Konstrukteur","78",null,"Projektmitarbeiter",null,"Projektmitarbeiter",null,"Projektmitarbeiter",null,null,null,null,null,"Projektleiter/_Projektmanager",null,"Prüfungsassistent",null,null,null,"Mitarbeiter",null,"Konstrukteur",null,"Personalreferent",null,null,null,null,"Finanzwesen","15",null,"Projektingenieur","Portfoliomanager","Projektingenieur","Projektleiter/_Projektmanager","Augsburg","16"]
["I","Sprachen",null,"nicht akademisch",2,null,"Barbados","17","Griechisch","17",null,null,"Nordrhein-Westfalen",null,null,null,null,null,null,null,"Energietechnik","485",null,"Elektronik und Elektrotechnik","19","Sachsen",null,null,"Laborleiter","79",null,"Prozessmanager",null,"Prozessmanager",null,"Prozessmanager",null,null,null,null,null,"Projektmitarbeiter",null,"Rechtsanwalt",null,null,null,"Portfoliomanager",null,"Mitarbeiter",null,"Portfoliomanager",null,null,null,null,"Forschung und Entwicklung","17",null,"Projektleiter/_Projektmanager","Produkt_Manager","Projektleiter/_Projektmanager","Projektmitarbeiter","Aurich","17"]
["K","Sprachkenntnisse",null,"Ausbildung",3,null,"Belgien","18","Hebräisch","18",null,null,"Rheinland-Pfalz",null,null,null,null,null,null,null,"Fahrzeugtechnik","612",null,"Energietechnik und Energiewirtschaft",20,"Sachsen-Anhalt",null,null,"Marketing_Assistent",105,null,"Prüfungsassistent",null,"Prüfungsassistent",null,"Prüfungsassistent",null,null,null,null,null,"Prozessmanager",null,"Redakteur",null,null,null,"Produkt_Manager",null,"Personalreferent",null,"Produkt_Manager",null,null,null,null,"Gesundheitsmanagement",141,null,"Projektmitarbeiter","Projektingenieur","Projektmitarbeiter","Prozessmanager","Baar","18"]
["M","Land_Praktika",null,"keine Ausbildung",4,null,"Belize","19","Hindi","19",null,null,"Saarbrücken",null,null,null,null,null,null,null,"Lebensmitteltechnik","1251",null,"Entsorgung und Recycling","21","Schleswig-Holstein",null,null,"Mitarbeiter",106,null,"Redakteur",null,"Redakteur",null,"Redakteur",null,null,null,null,null,"Prüfungsassistent",null,"Referent",null,null,null,"Projektingenieur",null,"Portfoliomanager",null,"Projektleiter/_Projektmanager",null,null,null,null,"IT","19",null,"Prozessmanager","Projektleiter/_Projektmanager","Prozessmanager","Prüfungsassistent","Bad Cannstatt","19"]
[null,"Branche",null,null,null,null,"Benin","20","Isländisch","20",null,null,"Saarland",null,null,null,null,null,null,null,"Luft- und Raumfahrttechnik","1284",null,"Event- und Kulturmanagement",137,"Stuttgart",null,null,"Personalreferent","23",null,"Referent",null,"Referent",null,"Referent",null,null,null,null,null,"Redakteur",null,"Steuerassistent/_Wirtschaftsprüfungsassistent",null,null,null,"Projektleiter/_Projektmanager",null,"Produkt_Manager",null,"Projektmitarbeiter",null,null,null,null,"IT-Consulting","21",null,"Prüfungsassistent","Projektmitarbeiter","Prüfungsassistent","Redakteur","Bad Colberg","20"]
[null,null,null,null,null,null,"Bhutan","21","Italienisch","21",null,null,"Sachsen",null,null,null,null,null,null,null,"Maschinenbau","1313",null,"Feinmechanik, Optik",134,"Thüringen",null,null,"Pharmareferent","48",null,"Sales_Manager",null,"Sales_Manager",null,"Sales_Manager",null,null,null,null,null,"Referent",null,"Strategie_Consultant",null,null,null,"Projektmitarbeiter",null,"Projektingenieur",null,"Prozessmanager",null,null,null,null,"Key Account Management","97",null,"Redakteur","Prozessmanager","Redakteur","Referent","Bad Driburg","21"]
["O","Studium",null,null,null,null,"Bolivien","22","Japanisch","22",null,null,"Sachsen-Anhalt",null,null,null,null,null,null,null,"Mechatronik","1370",null,"Finanzdienstleistungen","26",null,null,null,"Portfoliomanager",25,null,"Strategie_Consultant",null,"Softwareentwickler",null,"Softwareentwickler",null,null,null,null,null,"Sales_Manager",null,"Syndikus/_Justiziar",null,null,null,"Prozessmanager",null,"Projektleiter/_Projektmanager",null,"Prüfungsassistent",null,null,null,null,"Konstruktion","25",null,"Referent","Prüfungsassistent","Referent","Sales_Manager","Bad Harzburg","22"]
["O","Hochschulart",null,null,null,null,"Bosnien-Herzegowina","23","Kasachisch","23",null,null,"Schleswig-Holstein",null,null,null,null,null,null,null,"Medizintechnik","1439",null,"Forschungsinstitute","27",null,null,null,"Produkt_Manager","25",null,"Trainee",null,"Strategie_Consultant",null,"Strategie_Consultant",null,null,null,null,null,"Softwareentwickler",null,"Trainee",null,null,null,"Prüfungsassistent",null,"Projektmitarbeiter",null,"Redakteur",null,null,null,null,"Logistik","26",null,"Sales_Manager","Redakteur","Sales_Manager","Softwareentwickler","Bad Hersfeld","23"]
["Q","Abschluss",null,null,null,null,"Botsuana","24","Katalanisch","24",null,null,"Stuttgart",null,null,null,null,null,null,null,"Umwelttechnik","2125",null,"Gen- und Biotechnologie",133,null,null,null,"Projektingenieur","84",null,"Trainee_Filialleiter/_Verkaufsleiter",null,"Technischer_Angestellter",null,"Technischer_Angestellter",null,null,null,null,null,"Strategie_Consultant",null,"Vertriebler",null,null,null,"Redakteur",null,"Prozessmanager",null,"Referent",null,null,null,null,"Marketing","27",null,"Softwareentwickler","Referent","Softwareentwickler","Strategie_Consultant","Bad Hindelang","24"]
["S","Fachbereich",null,null,null,null,"Brasilien","25","Koreanisch","25",null,null,"Thüringen",null,null,null,null,null,null,null,"Verfahrenstechnik","2154",null,"Gesundheitswesen","31",null,null,null,"Projektleiter/_Projektmanager",26,null,"Vertriebler",null,"Trainee",null,"Trainee",null,null,null,null,null,"Technischer_Angestellter",null,"Wirtschaftsprüfungsassistent/_Steuerassistent",null,null,null,"Referent",null,"Prüfungsassistent",null,"Sales_Manager",null,null,null,null,"Marktforschung","28",null,"Strategie_Consultant","Sales_Manager","Strategie_Consultant","Technischer_Angestellter","Bad Homburg","25"]
["U","Studiengang",null,"Antwort",null,null,"Brunei","26","Kreolisch","26",null,null,null,null,null,null,null,null,null,null,null,null,null,"Großhandel","33",null,null,null,"Projektmitarbeiter","27",null,"Wissenschaftlicher_Mitarbeiter",null,"Trainee_Filialleiter/_Verkaufsleiter",null,"Trainee_Filialleiter/_Verkaufsleiter",null,null,null,null,null,"Trainee",null,"Wissenschaftlicher_Mitarbeiter",null,null,null,"Sales_Manager",null,"Redakteur",null,"Steuerassistent/_Wirtschaftsprüfungsassistent",null,null,null,null,"Mediengestaltung","30",null,"Technischer_Angestellter","Softwareentwickler","Technischer_Angestellter","Trainee","Bad Honnef","26"]
["BK","Hochschulort",null,"Ja",null,null,"Bulgarien","27","Kroatisch","27",null,null,null,null,null,null,null,null,null,null,"Naturwissenschaften",null,null,"Hotelgewerbe","38",null,null,null,"Prozessmanager","85",null,null,null,"Vertriebler",null,"Vertriebler",null,null,null,null,null,"Trainee_Filialleiter/_Verkaufsleiter",null,null,null,null,null,"Softwareentwickler",null,"Referent",null,"Strategie_Consultant",null,null,null,null,"Online-Marketing","100",null,"Trainee","Strategie_Consultant","Trainee","Trainee_Filialleiter/_Verkaufsleiter","Bad Iburg","27"]
["X","Wunschunternehmen",null,"Nein",null,null,"Burkina Faso","28","Kurdisch","28",null,null,null,null,null,null,null,null,null,null,"Naturwissenschaften allgemein","1545",null,"Immobilien","39",null,null,null,"Prüfungsassistent","49",null,null,null,"Wissenschaftlicher_Mitarbeiter",null,"Wissenschaftlicher_Mitarbeiter",null,null,null,null,null,"Vertriebler",null,null,null,null,null,"Strategie_Consultant",null,"Sales_Manager",null,"Trainee",null,null,null,null,"Personalwesen","37",null,"Trainee_Filialleiter/_Verkaufsleiter","Technischer_Angestellter","Trainee_Filialleiter/_Verkaufsleiter","Vertriebler","Bad Malente","28"]
["X","Branche",null,null,null,null,"Burundi","29","Lao","29",null,null,null,null,null,null,null,null,null,null,"Agrarwissenschaft","16",null,"Industrie",150,null,null,null,"Rechtsanwalt","86",null,null,null,null,null,null,null,null,null,null,null,"Wissenschaftlicher_Mitarbeiter",null,null,null,null,null,"Technischer_Angestellter",null,"Softwareentwickler",null,"Trainee_Filialleiter/_Verkaufsleiter",null,null,null,null,"Planung","74",null,"Vertriebler","Trainee","Vertriebler","Wissenschaftlicher_Mitarbeiter","Bad Mergentheim","29"]
["Z","Standort",null,null,null,null,"Chile","30","Lappisch","30",null,null,null,null,null,null,null,null,null,null,"Biologie","232",null,"Ingenieurbüro","41",null,null,null,"Redakteur","50",null,null,null,null,null,null,null,null,null,null,null,null,null,null,null,null,null,"Trainee",null,"Steuerassistent/_Wirtschaftsprüfungsassistent",null,"Vertriebler",null,null,null,null,"Portfoliomanagement","78",null,"Wissenschaftlicher_Mitarbeiter","Trainee_Filialleiter/_Verkaufsleiter","Wissenschaftlicher_Mitarbeiter",null,"Bad Nauheim","30"]
["AB1","Unternehmensgröße",null,"Geschlecht",null,null,"China","31","Latein","31",null,null,null,null,null,null,null,null,null,null,"Chemie","301",null,"Ingenieurdienstleistungen",135,null,null,null,"Referent","51",null,null,null,null,null,null,null,null,null,null,null,null,null,null,null,null,null,"Trainee_Filialleiter/_Verkaufsleiter",null,"Strategie_Consultant",null,"Wirtschaftsprüfungsassistent/_Steuerassistent",null,null,null,null,"Produktion und Fertigung","38",null,null,"Vertriebler",null,null,"Bad Oldesloe","31"]
["AB10","Unternehmensgröße_Branche",null," - Bitte auswählen -",null,null,"Costa Rica","32","Lettisch","32",null,null,null,null,null,null,null,null,null,null,"Ernährungswissenschaften","525",null,"Internet","42",null,null,null,"Sales_Manager","87",null,null,null,null,null,null,null,null,null,null,null,null,null,null,null,null,null,"Vertriebler",null,"Technischer_Angestellter",null,"Wissenschaftlicher_Mitarbeiter",null,null,null,null,"Produktmanagement","39",null,null,"Wissenschaftlicher_Mitarbeiter",null,null,"Bad Schmiedeberg","32"]
[null,null,null,"männlich",null,null,"Dänemark","33","Litauisch","33",null,null,null,null,null,null,null,null,null,null,"Mathematik","1346",null,"Investmentbanking","44",null,null,null,"Softwareentwickler","95",null,null,null,null,null,null,null,null,null,null,null,null,null,null,null,null,null,"Wissenschaftlicher_Mitarbeiter",null,"Trainee",null,null,null,null,null,null,"Projektmanagement","42",null,null,null,null,null,"Bad Soden","33"]
["AC","Position (alle)",null,"weiblich",null,null,"Deutschland","34","Malaiisch","34",null,null,null,null,null,null,null,null,null,null,"Pharmazie","1650",null,"IT","45",null,null,null,"Steuerassistent/_Wirtschaftsprüfungsassistent",112,null,null,null,null,null,null,null,null,null,null,null,null,null,null,null,null,null,null,null,"Trainee_Filialleiter/_Verkaufsleiter",null,null,null,null,null,null,"Prozessmanagement","105",null,null,null,null,null,"Bad Streben","34"]
[null,"Geistes_und_SozialwissenschaftenPos",null,null,null,null,"Dominica","35","Maldivisch","35",null,null,null,null,null,null,null,null,null,null,"Physik","1670",null,"Kanzleien und Rechtsanwälte",151,null,null,null,"Strategie_Consultant",108,null,null,null,null,null,null,null,null,null,null,null,null,null,null,null,null,null,null,null,"Vertriebler",null,null,null,null,null,null,"Public Relation und Unternehmenskommunikation",145,null,null,null,null,null,"Bad Waldliesborn","35"]
[null,"InformatikPos",null,"MLP_Kunde",null,null,"Dominikanische Republik","36","Massai","36",null,null,null,null,null,null,null,null,null,null,"Psychologie","1746",null,"Konsum- und Gebrauchsgüter",136,null,null,null,"Syndikus/_Justiziar",103,null,null,null,null,null,null,null,null,null,null,null,null,null,null,null,null,null,null,null,"Wirtschaftsprüfungsassistent/_Steuerassistent",null,null,null,null,null,null,"Qualitätswesen","45",null,null,null,null,null,"Bad Waldsee","36"]
[null,"IngenieurwissenschaftenPos",null," - Bitte auswählen -",null,null,"Dschibuti","37","Mauretanisch","37",null,null,null,null,null,null,null,null,null,null,"Wirtschaftsmathematik","2265",null,"Kosmetik","53",null,null,null,"Technischer_Angestellter","35",null,null,null,null,null,null,null,null,null,null,null,null,null,null,null,null,null,null,null,"Wissenschaftlicher_Mitarbeiter",null,null,null,null,null,null,"Rechnungswesen","46",null,null,null,null,null,"Baden-Baden","37"]
[null,"NaturwissenschaftenPos",null,"Ja",null,null,"Ecuador","38","Mazedonisch","38",null,null,null,null,null,null,null,null,null,null,"Wirtschaftspsychologie","2271",null,"Kultur- und Eventmanagement",137,null,null,null,"Trainee","37",null,null,null,null,null,null,null,null,null,null,null,null,null,null,null,null,null,null,null,null,null,null,null,null,null,null,"Recht","47",null,null,null,null,null,"Bamberg","38"]
[null,"RechtswissenschaftenPos",null,"Nein",null,null,"El Salvador","39","Moldawisch","39",null,null,null,null,null,null,null,null,null,null,null,null,null,"Kunststoff, Gummi, Glas und Keramik",138,null,null,null,"Trainee_Filialleiter/_Verkaufsleiter",114,null,null,null,null,null,null,null,null,null,null,null,null,null,null,null,null,null,null,null,null,null,null,null,null,null,null,"Redaktion","48",null,null,null,null,null,"Barcelona","39"]
[null,"WirtschaftsinformatikPos",null,null,null,null,"Elfenbeinküste","40","Mongolisch","40",null,null,null,null,null,null,null,null,null,null,"Rechtswissenschaften",null,null,"Lebens- und Genussmittel","56",null,null,null,"Vertriebler","91",null,null,null,null,null,null,null,null,null,null,null,null,null,null,null,null,null,null,null,null,null,null,null,null,null,null,"Risikomanagement","110",null,null,null,null,null,"Bardenberg","40"]
[null,"WirtschaftsingenieurwesenPos",null,null,null,null,"England",52,"Naururisch","41",null,null,null,null,null,null,null,null,null,null,"Rechtswissenschaften allgemein","1770",null,"Lebensmitteltechnologie",139,null,null,null,"Wirtschaftsprüfungsassistent/_Steuerassistent",112,null,null,null,null,null,null,null,null,null,null,null,null,null,null,null,null,null,null,null,null,null,null,null,null,null,null,"Softwareentwicklung","52",null,null,null,null,null,"Basel","41"]
[null,"WirtschaftswissenschaftenPos",null,"Promotionsbewertung","Code",null,"Eritrea","41","Nepali","42",null,null,null,null,null,null,null,null,null,null,"Jura","2297",null,"Logistik, Transport und Verkehr","57",null,null,null,"Wissenschaftlicher_Mitarbeiter","57",null,null,null,null,null,null,null,null,null,null,null,null,null,null,null,null,null,null,null,null,null,null,null,null,null,null,"Sozialwesen",143,null,null,null,null,null,"Bautzen","42"]
[null,null,null,"keine",0,null,"Estland","42","Niederländisch","43",null,null,null,null,null,null,null,null,null,null,"Wirtschaftsrecht","2272",null,"Luft- und Raumfahrt","58",null,null,null," - Bitte auswählen -",{"$f":"\"\"","v":""},null,null,null,null,null,null,null,null,null,null,null,null,null,null,null,null,null,null,null,null,null,null,null,null,null,null,"Steuer- und Wirtschaftsprüfung",146,null,null,null,null,null,"Bayreuth","43"]
["BE","Tätigkeitsbereich (alle)",null,"summa cum laude",1,null,"Fidschi","43","Norwegisch","44",null,null,null,null,null,null,null,null,null,null,null,null,null,"Marketing, Werbung und Public Relation",147,null,null,null,0,{"$f":"\"\"","v":""},null,null,null,null,null,null,null,null,null,null,null,null,null,null,null,null,null,null,null,null,null,null,null,null,null,null,"Strategieentwicklung","114",null,null,null,null,null,"Benrath","44"]
[null,null,null,"magna cum laude",2,null,"Finnland","44","Patois","45",null,null,null,null,null,null,null,null,null,null,"Wirtschaftsinformatik",null,null,"Marktforschung","108",null,null,null," - Bitte zuerst Fachbereich auswählen -",{"$f":"\"\"","v":""},null,null,null,null,null,null,null,null,null,null,null,null,null,null,null,null,null,null,null,null,null,null,null,null,null,null,"Strategisches Produktmanagement",144,null,null,null,null,null,"Bergamo","45"]
["BH","Bedsonderheiten",null,"cum laude",3,null,"Frankreich","45","Persisch","46",null,null,null,null,null,null,null,null,null,null,"Wirtschaftsinformatik allgemein","2240",null,"Maschinenbau","59",null,null,null,null,null,null,null,null,null,null,null,null,null,null,null,null,null,null,null,null,null,null,null,null,null,null,null,null,null,null,null,"Therapie","117",null,null,null,null,null,"Bergisch Gladbach","46"]
[null,"NaturwissenschaftenPosPromotion",null,"rite",4,null,"Gabun","46","Polnisch","47",null,null,null,null,null,null,null,null,null,null,null,null,null,"Medien, Presse und Verlag",61,null,null,null,null,null,null,null,null,null,null,null,null,null,null,null,null,null,null,null,null,null,null,null,null,null,null,null,null,null,null,null,"Unternehmenskommunikation und Public Relation",145,null,null,null,null,null,"Bergwinkel","47"]
[null,"NaturwissenschaftenPosMathematik_Wmathe",null,"non rite",5,null,"Gambia","47","Portugiesisch","48",null,null,null,null,null,null,null,null,null,null,"Wirtschaftsingenieurwesen",null,null,"Medizintechnik","62",null,null,null,null,null,null,null,null,null,null,null,null,null,null,null,null,null,null,null,null,null,null,null,null,null,null,null,null,null,null,null,"Vertrieb-Außendienst","58",null,null,null,null,null,"Bernburg","48"]
["BK","Hochschulort",null,null,null,null,"Georgien","48","Rätoromanisch","49",null,null,null,null,null,null,null,null,null,null,"Wirtschaftsingenieurwesen allgemein","2235",null,"Mess-, Steuer- und Regelungstechnik",63,null,null,null,null,null,null,null,null,null,null,null,null,null,null,null,null,null,null,null,null,null,null,null,null,null,null,null,null,null,null,null,"Vertrieb-Innendienst","59",null,null,null,null,null,"Biberach","49"]
[null,null,null,null,null,null,"Ghana","49","Romani","50",null,null,null,null,null,null,null,null,null,null,null,null,null,"Messe/-wirtschaft","64",null,null,null,null,null,null,null,null,null,null,null,null,null,null,null,null,null,null,null,null,null,null,null,null,null,null,null,null,null,null,null,"Vertriebssteuerung","60",null,null,null,null,null,"Biel","50"]
[null,null,null,null,null,null,"Grenada","50","Rumänisch","51",null,null,null,null,null,null,null,null,null,null,"Wirtschaftswissenschaften",null,null,"Metallerzeugende und -verarbeitende Industrie","65",null,null,null,null,null,null,null,null,null,null,null,null,null,null,null,null,null,null,null,null,null,null,null,null,null,null,null,null,null,null,null,"Wirtschafts- und Steuerprüfung",146,null,null,null,null,null,"Bielefeld","51"]
[null,null,null,null,null,null,"Griechenland","51","Russisch","52",null,null,null,null,null,null,null,null,null,null,"Wirtschaftswissenschaften allgemein","2277",null,"Möbel- und Holzindustrie",140,null,null,null,null,null,null,null,null,null,null,null,null,null,null,null,null,null,null,null,null,null,null,null,null,null,null,null,null,null,null,null," - Bitte auswählen -",{"$f":"\"\"","v":""},null,null,null,null,null,"Bietigheim","52"]
[null,null,null,"Bitte_auswählenTB",null,null,"Großbritannien und Nordirland",52,"Schwedisch","53",null,null,null,null,null,null,null,null,null,null,"Business Administration","281",null,"Non Profit Organisationen","68",null,null,null,null,null,null,null,null,null,null,null,null,null,null,null,null,null,null,null,null,null,null,null,null,null,null,null,null,null,null,null,0,{"$f":"\"\"","v":""},null,null,null,null,null,"Bingen","53"]
[null,null,null," - Bitte auswählen -",null,null,"Guatemala","53","Serbisch","54",null,null,null,null,null,null,null,null,null,null,"BWL","297",null,"Papier- und Verpackungsindustrie",141,null,null,null,null,null,null,null,null,null,null,null,null,null,null,null,null,null,null,null,null,null,null,null,null,null,null,null,null,null,null,null," - Bitte zuerst Position auswählen -",{"$f":"\"\"","v":""},null,null,null,null,null,"Birkenfeld","54"]
[null,null,null," - Bitte zuerst Position auswählen -",null,null,"Guinea","54","Serbokroatisch","55",null,null,null,null,null,null,null,null,null,null,"International Business Administration","999",null,"Personalberatung","74",null,null,null,null,null,null,null,null,null,null,null,null,null,null,null,null,null,null,null,null,null,null,null,null,null,null,null,null,null,null,null,null,null,null,null,null,null,null,"Birmingham","55"]
[null,null,null,null,null,null,"Guinea-Bissau","55","Singhalesisch","56",null,null,null,null,null,null,null,null,null,null,"Internationale BWL","986",null,"Pharma und Medika","75",null,null,null,null,null,null,null,null,null,null,null,null,null,null,null,null,null,null,null,null,null,null,null,null,null,null,null,null,null,null,null,null,null,null,null,null,null,null,"Bliekastel","56"]
[null,null,null,"Bitte_auswählenPos",null,null,"Guyana","56","Slowakisch","57",null,null,null,null,null,null,null,null,null,null,"VWL","2209",null,"Public Relation, Werbung und Marketing",147,null,null,null,null,null,null,null,null,null,null,null,null,null,null,null,null,null,null,null,null,null,null,null,null,null,null,null,null,null,null,null,null,null,null,null,null,null,null,"Böblingen","57"]
[null,null,null," - Bitte auswählen -",null,null,"Haiti","57","Slowenisch","58",null,null,null,null,null,null,null,null,null,null,"Wirtschaftsmathematik","2265",null,"Schiffbau","79",null,null,null,null,null,null,null,null,null,null,null,null,null,null,null,null,null,null,null,null,null,null,null,null,null,null,null,null,null,null,null,null,null,null,null,null,null,null,"Bocconi","58"]
[null,null,null," - Bitte zuerst Fachbereich auswählen -",null,null,"Honduras","58","Somali","59",null,null,null,null,null,null,null,null,null,null,"Wirtschaftspsychologie","2271",null,"Soziale Einrichtungen","87",null,null,null,null,null,null,null,null,null,null,null,null,null,null,null,null,null,null,null,null,null,null,null,null,null,null,null,null,null,null,null,null,null,null,null,null,null,null,"Bocholt","59"]
[null,null,null,null,null,null,"Indien","59","sonstige","60",null,null,null,null,null,null,null,null,null,null,"Wirtschaftsrecht","2272",null,"Stahlindustrie",143,null,null,null,null,null,null,null,null,null,null,null,null,null,null,null,null,null,null,null,null,null,null,null,null,null,null,null,null,null,null,null,null,null,null,null,null,null,null,"Bochum","60"]
[null,null,null,"Bitte_auswählenSG",null,null,"Indonesien","60","Spanisch","61",null,null,null,null,null,null,null,null,null,null,null,null,null,"Steuerberatung und Wirtschaftsprüfung",144,null,null,null,null,null,null,null,null,null,null,null,null,null,null,null,null,null,null,null,null,null,null,null,null,null,null,null,null,null,null,null,null,null,null,null,null,null,null,"Bologna","61"]
[null,null,null," - Bitte auswählen -",null,null,"Irak","61","Thai","62",null,null,null,null,null,null,null,null,null,null,null,null,null,"Stiftungen",145,null,null,null,null,null,null,null,null,null,null,null,null,null,null,null,null,null,null,null,null,null,null,null,null,null,null,null,null,null,null,null,null,null,null,null,null,null,null,"Bonn","62"]
[null,null,null," - Bitte zuerst Fachbereich auswählen -",null,null,"Iran","62","Tschechisch","63",null,null,null,null,null,null,null,null,null,null,null,null,null,"Strategische Unternehmensberatung","90",null,null,null,null,null,null,null,null,null,null,null,null,null,null,null,null,null,null,null,null,null,null,null,null,null,null,null,null,null,null,null,null,null,null,null,null,null,null,"Brabant","63"]
[null,null,null,null,null,null,"Irland","63","Türkisch","64",null,null,null,null,null,null,null,null,null,null,null,null,null,"Telekommunikation","91",null,null,null,null,null,null,null,null,null,null,null,null,null,null,null,null,null,null,null,null,null,null,null,null,null,null,null,null,null,null,null,null,null,null,null,null,null,null,"Brandenburg","64"]
[null,null,null,null,null,null,"Island","64","Turkmenisch","65",null,null,null,null,null,null,null,null,null,null,null,null,null,"Textil, Bekleidung und Mode","92",null,null,null,null,null,null,null,null,null,null,null,null,null,null,null,null,null,null,null,null,null,null,null,null,null,null,null,null,null,null,null,null,null,null,null,null,null,null,"Braunschweig","65"]
[null,null,null,null,null,null,"Israel","65","Ukrainisch","66",null,null,null,null,null,null,null,null,null,null,null,null,null,"Touristik und Freizeit","93",null,null,null,null,null,null,null,null,null,null,null,null,null,null,null,null,null,null,null,null,null,null,null,null,null,null,null,null,null,null,null,null,null,null,null,null,null,null,"Bremen","66"]
[null,null,null,null,null,null,"Italien","66","Ungarisch","67",null,null,null,null,null,null,null,null,null,null,null,null,null,"Umwelttechnik","127",null,null,null,null,null,null,null,null,null,null,null,null,null,null,null,null,null,null,null,null,null,null,null,null,null,null,null,null,null,null,null,null,null,null,null,null,null,null,"Bremerhaven","67"]
[null,null,null,null,null,null,"Jamaika","67","Usbekisch","68",null,null,null,null,null,null,null,null,null,null,null,null,null,"Verbände","96",null,null,null,null,null,null,null,null,null,null,null,null,null,null,null,null,null,null,null,null,null,null,null,null,null,null,null,null,null,null,null,null,null,null,null,null,null,null,"Brescia","68"]
[null,null,null,null,null,null,"Japan","68","Vietnamesisch","69",null,null,null,null,null,null,null,null,null,null,null,null,null,"Vereine","129",null,null,null,null,null,null,null,null,null,null,null,null,null,null,null,null,null,null,null,null,null,null,null,null,null,null,null,null,null,null,null,null,null,null,null,null,null,null,"Bretten","69"]
[null,null,null,null,null,null,"Jemen","69","Weißrussisch","70",null,null,null,null,null,null,null,null,null,null,null,null,null,"Versandhandel","99",null,null,null,null,null,null,null,null,null,null,null,null,null,null,null,null,null,null,null,null,null,null,null,null,null,null,null,null,null,null,null,null,null,null,null,null,null,null,"Bruchsal","70"]
[null,null,null,null,null,null,"Jordanien","70","sonstige","60",null,null,null,null,null,null,null,null,null,null,null,null,null,"Versicherungen","100",null,null,null,null,null,null,null,null,null,null,null,null,null,null,null,null,null,null,null,null,null,null,null,null,null,null,null,null,null,null,null,null,null,null,null,null,null,null,"Brugg","71"]
[null,null,null,null,null,null,"Jugoslawien","71",0,{"$f":"\"\"","v":""},null,null,null,null,null,null,null,null,null,null,null,null,null,"Werbung, Public Relation und Marketing",147,null,null,null,null,null,null,null,null,null,null,null,null,null,null,null,null,null,null,null,null,null,null,null,null,null,null,null,null,null,null,null,null,null,null,null,null,null,null,"Buchs","72"]
[null,null,null,null,null,null,"Kambodscha","72","unbekannt","71",null,null,null,null,null,null,null,null,null,null,null,null,null,"Wirtschaftsprüfung und Steuerberatung",144,null,null,null,null,null,null,null,null,null,null,null,null,null,null,null,null,null,null,null,null,null,null,null,null,null,null,null,null,null,null,null,null,null,null,null,null,null,null,"Burg","73"]
[null,null,null,null,null,null,"Kamerun","73",null,null,null,null,null,null,null,null,null,null,null,null,null,null,null,"Zeitarbeit und Personalvermittlung","105",null,null,null,null,null,null,null,null,null,null,null,null,null,null,null,null,null,null,null,null,null,null,null,null,null,null,null,null,null,null,null,null,null,null,null,null,null,null,"Burgdorf","74"]
[null,null,null,null,null,null,"Kanada","74",null,null,null,null,null,null,null,null,null,null,null,null,null,null,null,null,null,null,null,null,null,null,null,null,null,null,null,null,null,null,null,null,null,null,null,null,null,null,null,null,null,null,null,null,null,null,null,null,null,null,null,null,null,null,null,"Burgfeld","75"]
[null,null,null,null,null,null,"Kap Verde","75",null,null,null,null,null,null,null,null,null,null,null,null,null,null,null,null,null,null,null,null,null,null,null,null,null,null,null,null,null,null,null,null,null,null,null,null,null,null,null,null,null,null,null,null,null,null,null,null,null,null,null,null,null,null,null,"Burgwedel","76"]
[null,null,null,null,null,null,"Kasachstan","76",null,null,null,null,null,null,null,null,null,null,null,null,null,null,null,"Branche Doppelte Werte!",null,null,null,null,null,null,null,null,null,null,null,null,null,null,null,null,null,null,null,null,null,null,null,null,null,null,null,null,null,null,null,null,null,null,null,null,null,null,null,"Buxtehude","77"]
[null,null,null,null,null,null,"Katar","77",null,null,null,null,null,null,null,null,null,null,null,null,null,null,null,"Bio- und Gentechnologie",null,null,null,null,null,null,null,null,null,null,null,null,null,null,null,null,null,null,null,null,null,null,null,null,null,null,null,null,null,null,null,null,null,null,null,null,null,null,null,"Cambridge","78"]
[null,null,null,null,null,null,"Kenia","78",null,null,null,null,null,null,null,null,null,null,null,null,null,null,null,"Gen- und Biotechnologie",null,null,null,null,null,null,null,null,null,null,null,null,null,null,null,null,null,null,null,null,null,null,null,null,null,null,null,null,null,null,null,null,null,null,null,null,null,null,null,"Camerino","79"]
[null,null,null,null,null,null,"Kirgisistan","79",null,null,null,null,null,null,null,null,null,null,null,null,null,null,null,null,null,null,null,null,null,null,null,null,null,null,null,null,null,null,null,null,null,null,null,null,null,null,null,null,null,null,null,null,null,null,null,null,null,null,null,null,null,null,null,"Canobbio","80"]
[null,null,null,null,null,null,"Kiribati","80",null,null,null,null,null,null,null,null,null,null,null,null,null,null,null,"Kultur- und Eventmanagement",null,null,null,null,null,null,null,null,null,null,null,null,null,null,null,null,null,null,null,null,null,null,null,null,null,null,null,null,null,null,null,null,null,null,null,null,null,null,null,"Castellanza","81"]
[null,null,null,null,null,null,"Kolumbien","81",null,null,null,null,null,null,null,null,null,null,null,null,null,null,null,"Event- und Kulturmanagement",null,null,null,null,null,null,null,null,null,null,null,null,null,null,null,null,null,null,null,null,null,null,null,null,null,null,null,null,null,null,null,null,null,null,null,null,null,null,null,"Charlottenburg","82"]
[null,null,null,null,null,null,"Komoren","82",null,null,null,null,null,null,null,null,null,null,null,null,null,null,null,null,null,null,null,null,null,null,null,null,null,null,null,null,null,null,null,null,null,null,null,null,null,null,null,null,null,null,null,null,null,null,null,null,null,null,null,null,null,null,null,"Chemnitz","83"]
[null,null,null,null,null,null,"Kongo (Ex-Zaire)","83",null,null,null,null,null,null,null,null,null,null,null,null,null,null,null,"Steuerberatung und Wirtschaftsprüfung",null,null,null,null,null,null,null,null,null,null,null,null,null,null,null,null,null,null,null,null,null,null,null,null,null,null,null,null,null,null,null,null,null,null,null,null,null,null,null,"Chur","84"]
[null,null,null,null,null,null,"Kongo, Republik","84",null,null,null,null,null,null,null,null,null,null,null,null,null,null,null,"Wirtschaftsprüfung und Steuerberatung",null,null,null,null,null,null,null,null,null,null,null,null,null,null,null,null,null,null,null,null,null,null,null,null,null,null,null,null,null,null,null,null,null,null,null,null,null,null,null,"Clausthal","85"]
[null,null,null,null,null,null,"Korea (Nord- und Süd)","85",null,null,null,null,null,null,null,null,null,null,null,null,null,null,null,null,null,null,null,null,null,null,null,null,null,null,null,null,null,null,null,null,null,null,null,null,null,null,null,null,null,null,null,null,null,null,null,null,null,null,null,null,null,null,null,"Coburg","86"]
[null,null,null,null,null,null,"Kroatien","86",null,null,null,null,null,null,null,null,null,null,null,null,null,null,null,"Werbung, Public Relation und Marketing",null,null,null,null,null,null,null,null,null,null,null,null,null,null,null,null,null,null,null,null,null,null,null,null,null,null,null,null,null,null,null,null,null,null,null,null,null,null,null,"Como","87"]
[null,null,null,null,null,null,"Kuba","87",null,null,null,null,null,null,null,null,null,null,null,null,null,null,null,"Public Relation, Werbung und Marketing",null,null,null,null,null,null,null,null,null,null,null,null,null,null,null,null,null,null,null,null,null,null,null,null,null,null,null,null,null,null,null,null,null,null,null,null,null,null,null,"Córdoba","88"]
[null,null,null,null,null,null,"Kuwait","88",null,null,null,null,null,null,null,null,null,null,null,null,null,null,null,"Marketing, Werbung und Public Relation",null,null,null,null,null,null,null,null,null,null,null,null,null,null,null,null,null,null,null,null,null,null,null,null,null,null,null,null,null,null,null,null,null,null,null,null,null,null,null,"Coswig","89"]
[null,null,null,null,null,null,"Laos","89",null,null,null,null,null,null,null,null,null,null,null,null,null,null,null,null,null,null,null,null,null,null,null,null,null,null,null,null,null,null,null,null,null,null,null,null,null,null,null,null,null,null,null,null,null,null,null,null,null,null,null,null,null,null,null,"Cottbus","90"]
[null,null,null,null,null,null,"Lettland","90",null,null,null,null,null,null,null,null,null,null,null,null,null,null,null,null,null,null,null,null,null,null,null,null,null,null,null,null,null,null,null,null,null,null,null,null,null,null,null,null,null,null,null,null,null,null,null,null,null,null,null,null,null,null,null,"Cranfield","91"]
[null,null,null,null,null,null,"Libanon","91",null,null,null,null,null,null,null,null,null,null,null,null,null,null,null,null,null,null,null,null,null,null,null,null,null,null,null,null,null,null,null,null,null,null,null,null,null,null,null,null,null,null,null,null,null,null,null,null,null,null,null,null,null,null,null,"Cuxhaven","92"]
[null,null,null,null,null,null,"Liberia","92",null,null,null,null,null,null,null,null,null,null,null,null,null,null,null,null,null,null,null,null,null,null,null,null,null,null,null,null,null,null,null,null,null,null,null,null,null,null,null,null,null,null,null,null,null,null,null,null,null,null,null,null,null,null,null,"Darmstadt","93"]
[null,null,null,null,null,null,"Liechtenstein","93",null,null,null,null,null,null,null,null,null,null,null,null,null,null,null,null,null,null,null,null,null,null,null,null,null,null,null,null,null,null,null,null,null,null,null,null,null,null,null,null,null,null,null,null,null,null,null,null,null,null,null,null,null,null,null,"Deggendorf","94"]
[null,null,null,null,null,null,"Litauen","94",null,null,null,null,null,null,null,null,null,null,null,null,null,null,null,null,null,null,null,null,null,null,null,null,null,null,null,null,null,null,null,null,null,null,null,null,null,null,null,null,null,null,null,null,null,null,null,null,null,null,null,null,null,null,null,"Delft","95"]
[null,null,null,null,null,null,"Luxemburg","95",null,null,null,null,null,null,null,null,null,null,null,null,null,null,null,null,null,null,null,null,null,null,null,null,null,null,null,null,null,null,null,null,null,null,null,null,null,null,null,null,null,null,null,null,null,null,null,null,null,null,null,null,null,null,null,"Dessau","96"]
[null,null,null,null,null,null,"Lybien","96",null,null,null,null,null,null,null,null,null,null,null,null,null,null,null,null,null,null,null,null,null,null,null,null,null,null,null,null,null,null,null,null,null,null,null,null,null,null,null,null,null,null,null,null,null,null,null,null,null,null,null,null,null,null,null,"Detmold","97"]
[null,null,null,null,null,null,"Madagaskar","97",null,null,null,null,null,null,null,null,null,null,null,null,null,null,null,null,null,null,null,null,null,null,null,null,null,null,null,null,null,null,null,null,null,null,null,null,null,null,null,null,null,null,null,null,null,null,null,null,null,null,null,null,null,null,null,"Deusto","98"]
[null,null,null,null,null,null,"Malawi","98",null,null,null,null,null,null,null,null,null,null,null,null,null,null,null,null,null,null,null,null,null,null,null,null,null,null,null,null,null,null,null,null,null,null,null,null,null,null,null,null,null,null,null,null,null,null,null,null,null,null,null,null,null,null,null,"Donaueschingen","99"]
[null,null,null,null,null,null,"Malaysia ","99",null,null,null,null,null,null,null,null,null,null,null,null,null,null,null,null,null,null,null,null,null,null,null,null,null,null,null,null,null,null,null,null,null,null,null,null,null,null,null,null,null,null,null,null,null,null,null,null,null,null,null,null,null,null,null,"Donau-Ries","100"]
[null,null,null,null,null,null,"Malediven","100",null,null,null,null,null,null,null,null,null,null,null,null,null,null,null,null,null,null,null,null,null,null,null,null,null,null,null,null,null,null,null,null,null,null,null,null,null,null,null,null,null,null,null,null,null,null,null,null,null,null,null,null,null,null,null,"Dormagen","101"]
[null,null,null,null,null,null,"Mali","101",null,null,null,null,null,null,null,null,null,null,null,null,null,null,null,null,null,null,null,null,null,null,null,null,null,null,null,null,null,null,null,null,null,null,null,null,null,null,null,null,null,null,null,null,null,null,null,null,null,null,null,null,null,null,null,"Dornbirn","102"]
[null,null,null,null,null,null,"Marokko","102",null,null,null,null,null,null,null,null,null,null,null,null,null,null,null,null,null,null,null,null,null,null,null,null,null,null,null,null,null,null,null,null,null,null,null,null,null,null,null,null,null,null,null,null,null,null,null,null,null,null,null,null,null,null,null,"Dortmund","103"]
[null,null,null,null,null,null,"Marshallinseln","103",null,null,null,null,null,null,null,null,null,null,null,null,null,null,null,null,null,null,null,null,null,null,null,null,null,null,null,null,null,null,null,null,null,null,null,null,null,null,null,null,null,null,null,null,null,null,null,null,null,null,null,null,null,null,null,"Dresden","104"]
[null,null,null,null,null,null,"Mauretanien","104",null,null,null,null,null,null,null,null,null,null,null,null,null,null,null,null,null,null,null,null,null,null,null,null,null,null,null,null,null,null,null,null,null,null,null,null,null,null,null,null,null,null,null,null,null,null,null,null,null,null,null,null,null,null,null,"Duisburg","105"]
[null,null,null,null,null,null,"Mauritius","105",null,null,null,null,null,null,null,null,null,null,null,null,null,null,null,null,null,null,null,null,null,null,null,null,null,null,null,null,null,null,null,null,null,null,null,null,null,null,null,null,null,null,null,null,null,null,null,null,null,null,null,null,null,null,null,"Dundee","106"]
[null,null,null,null,null,null,"Mazedonien","106",null,null,null,null,null,null,null,null,null,null,null,null,null,null,null,null,null,null,null,null,null,null,null,null,null,null,null,null,null,null,null,null,null,null,null,null,null,null,null,null,null,null,null,null,null,null,null,null,null,null,null,null,null,null,null,"Dünkeloh","107"]
[null,null,null,null,null,null,"Mexiko","107",null,null,null,null,null,null,null,null,null,null,null,null,null,null,null,null,null,null,null,null,null,null,null,null,null,null,null,null,null,null,null,null,null,null,null,null,null,null,null,null,null,null,null,null,null,null,null,null,null,null,null,null,null,null,null,"Düren","108"]
[null,null,null,null,null,null,"Mikronesien","108",null,null,null,null,null,null,null,null,null,null,null,null,null,null,null,null,null,null,null,null,null,null,null,null,null,null,null,null,null,null,null,null,null,null,null,null,null,null,null,null,null,null,null,null,null,null,null,null,null,null,null,null,null,null,null,"Düsseldorf","109"]
[null,null,null,null,null,null,"Moldau","109",null,null,null,null,null,null,null,null,null,null,null,null,null,null,null,null,null,null,null,null,null,null,null,null,null,null,null,null,null,null,null,null,null,null,null,null,null,null,null,null,null,null,null,null,null,null,null,null,null,null,null,null,null,null,null,"Eberswalde","110"]
[null,null,null,null,null,null,"Monaco","110",null,null,null,null,null,null,null,null,null,null,null,null,null,null,null,null,null,null,null,null,null,null,null,null,null,null,null,null,null,null,null,null,null,null,null,null,null,null,null,null,null,null,null,null,null,null,null,null,null,null,null,null,null,null,null,"Eckernförde","111"]
[null,null,null,null,null,null,"Mongolei","111",null,null,null,null,null,null,null,null,null,null,null,null,null,null,null,null,null,null,null,null,null,null,null,null,null,null,null,null,null,null,null,null,null,null,null,null,null,null,null,null,null,null,null,null,null,null,null,null,null,null,null,null,null,null,null,"Edinburgh","112"]
[null,null,null,null,null,null,"Mosambik","112",null,null,null,null,null,null,null,null,null,null,null,null,null,null,null,null,null,null,null,null,null,null,null,null,null,null,null,null,null,null,null,null,null,null,null,null,null,null,null,null,null,null,null,null,null,null,null,null,null,null,null,null,null,null,null,"Eichstätt","113"]
[null,null,null,null,null,null,"Myanmar (Ex-Burma)","113",null,null,null,null,null,null,null,null,null,null,null,null,null,null,null,null,null,null,null,null,null,null,null,null,null,null,null,null,null,null,null,null,null,null,null,null,null,null,null,null,null,null,null,null,null,null,null,null,null,null,null,null,null,null,null,"Einbeck","114"]
[null,null,null,null,null,null,"Namibia","114",null,null,null,null,null,null,null,null,null,null,null,null,null,null,null,null,null,null,null,null,null,null,null,null,null,null,null,null,null,null,null,null,null,null,null,null,null,null,null,null,null,null,null,null,null,null,null,null,null,null,null,null,null,null,null,"Eindhoven","115"]
[null,null,null,null,null,null,"Nauru","115",null,null,null,null,null,null,null,null,null,null,null,null,null,null,null,null,null,null,null,null,null,null,null,null,null,null,null,null,null,null,null,null,null,null,null,null,null,null,null,null,null,null,null,null,null,null,null,null,null,null,null,null,null,null,null,"Eisenach","116"]
[null,null,null,null,null,null,"Nepal","116",null,null,null,null,null,null,null,null,null,null,null,null,null,null,null,null,null,null,null,null,null,null,null,null,null,null,null,null,null,null,null,null,null,null,null,null,null,null,null,null,null,null,null,null,null,null,null,null,null,null,null,null,null,null,null,"Eisenstadt","117"]
[null,null,null,null,null,null,"Neuseeland","117",null,null,null,null,null,null,null,null,null,null,null,null,null,null,null,null,null,null,null,null,null,null,null,null,null,null,null,null,null,null,null,null,null,null,null,null,null,null,null,null,null,null,null,null,null,null,null,null,null,null,null,null,null,null,null,"Elmshorn","118"]
[null,null,null,null,null,null,"Nicaragua","118",null,null,null,null,null,null,null,null,null,null,null,null,null,null,null,null,null,null,null,null,null,null,null,null,null,null,null,null,null,null,null,null,null,null,null,null,null,null,null,null,null,null,null,null,null,null,null,null,null,null,null,null,null,null,null,"Emden","119"]
[null,null,null,null,null,null,"Niederlande","119",null,null,null,null,null,null,null,null,null,null,null,null,null,null,null,null,null,null,null,null,null,null,null,null,null,null,null,null,null,null,null,null,null,null,null,null,null,null,null,null,null,null,null,null,null,null,null,null,null,null,null,null,null,null,null,"Engelskirchen","120"]
[null,null,null,null,null,null,"Niger","120",null,null,null,null,null,null,null,null,null,null,null,null,null,null,null,null,null,null,null,null,null,null,null,null,null,null,null,null,null,null,null,null,null,null,null,null,null,null,null,null,null,null,null,null,null,null,null,null,null,null,null,null,null,null,null,"Eppendorf","121"]
[null,null,null,null,null,null,"Nigeria","121",null,null,null,null,null,null,null,null,null,null,null,null,null,null,null,null,null,null,null,null,null,null,null,null,null,null,null,null,null,null,null,null,null,null,null,null,null,null,null,null,null,null,null,null,null,null,null,null,null,null,null,null,null,null,null,"Erfurt","122"]
[null,null,null,null,null,null,"Norwegen","122",null,null,null,null,null,null,null,null,null,null,null,null,null,null,null,null,null,null,null,null,null,null,null,null,null,null,null,null,null,null,null,null,null,null,null,null,null,null,null,null,null,null,null,null,null,null,null,null,null,null,null,null,null,null,null,"Erlangen","123"]
[null,null,null,null,null,null,"Oman","123",null,null,null,null,null,null,null,null,null,null,null,null,null,null,null,null,null,null,null,null,null,null,null,null,null,null,null,null,null,null,null,null,null,null,null,null,null,null,null,null,null,null,null,null,null,null,null,null,null,null,null,null,null,null,null,"Eschenberg","124"]
[null,null,null,null,null,null,"Österreich","124",null,null,null,null,null,null,null,null,null,null,null,null,null,null,null,null,null,null,null,null,null,null,null,null,null,null,null,null,null,null,null,null,null,null,null,null,null,null,null,null,null,null,null,null,null,null,null,null,null,null,null,null,null,null,null,"Eschweiler","125"]
[null,null,null,null,null,null,"Pakistan","125",null,null,null,null,null,null,null,null,null,null,null,null,null,null,null,null,null,null,null,null,null,null,null,null,null,null,null,null,null,null,null,null,null,null,null,null,null,null,null,null,null,null,null,null,null,null,null,null,null,null,null,null,null,null,null,"Essen","126"]
[null,null,null,null,null,null,"Palau","126",null,null,null,null,null,null,null,null,null,null,null,null,null,null,null,null,null,null,null,null,null,null,null,null,null,null,null,null,null,null,null,null,null,null,null,null,null,null,null,null,null,null,null,null,null,null,null,null,null,null,null,null,null,null,null,"Esslingen","127"]
[null,null,null,null,null,null,"Panama","127",null,null,null,null,null,null,null,null,null,null,null,null,null,null,null,null,null,null,null,null,null,null,null,null,null,null,null,null,null,null,null,null,null,null,null,null,null,null,null,null,null,null,null,null,null,null,null,null,null,null,null,null,null,null,null,"Euskirchen","128"]
[null,null,null,null,null,null,"Papua-Neuguinea","128",null,null,null,null,null,null,null,null,null,null,null,null,null,null,null,null,null,null,null,null,null,null,null,null,null,null,null,null,null,null,null,null,null,null,null,null,null,null,null,null,null,null,null,null,null,null,null,null,null,null,null,null,null,null,null,"Eutin","129"]
[null,null,null,null,null,null,"Paraguay","129",null,null,null,null,null,null,null,null,null,null,null,null,null,null,null,null,null,null,null,null,null,null,null,null,null,null,null,null,null,null,null,null,null,null,null,null,null,null,null,null,null,null,null,null,null,null,null,null,null,null,null,null,null,null,null,"Firenze","130"]
[null,null,null,null,null,null,"Peru","130",null,null,null,null,null,null,null,null,null,null,null,null,null,null,null,null,null,null,null,null,null,null,null,null,null,null,null,null,null,null,null,null,null,null,null,null,null,null,null,null,null,null,null,null,null,null,null,null,null,null,null,null,null,null,null,"Flensburg","131"]
[null,null,null,null,null,null,"Philippinen","131",null,null,null,null,null,null,null,null,null,null,null,null,null,null,null,null,null,null,null,null,null,null,null,null,null,null,null,null,null,null,null,null,null,null,null,null,null,null,null,null,null,null,null,null,null,null,null,null,null,null,null,null,null,null,null,"Frankfurt","132"]
[null,null,null,null,null,null,"Polen","132",null,null,null,null,null,null,null,null,null,null,null,null,null,null,null,null,null,null,null,null,null,null,null,null,null,null,null,null,null,null,null,null,null,null,null,null,null,null,null,null,null,null,null,null,null,null,null,null,null,null,null,null,null,null,null,"Frankfurt/Main","132"]
[null,null,null,null,null,null,"Portugal","133",null,null,null,null,null,null,null,null,null,null,null,null,null,null,null,null,null,null,null,null,null,null,null,null,null,null,null,null,null,null,null,null,null,null,null,null,null,null,null,null,null,null,null,null,null,null,null,null,null,null,null,null,null,null,null,"Frankfurt/Oder","133"]
[null,null,null,null,null,null,"Ruanda","134",null,null,null,null,null,null,null,null,null,null,null,null,null,null,null,null,null,null,null,null,null,null,null,null,null,null,null,null,null,null,null,null,null,null,null,null,null,null,null,null,null,null,null,null,null,null,null,null,null,null,null,null,null,null,null,"Frechen","134"]
[null,null,null,null,null,null,"Rumänien","135",null,null,null,null,null,null,null,null,null,null,null,null,null,null,null,null,null,null,null,null,null,null,null,null,null,null,null,null,null,null,null,null,null,null,null,null,null,null,null,null,null,null,null,null,null,null,null,null,null,null,null,null,null,null,null,"Freiberg","135"]
[null,null,null,null,null,null,"Rußland","136",null,null,null,null,null,null,null,null,null,null,null,null,null,null,null,null,null,null,null,null,null,null,null,null,null,null,null,null,null,null,null,null,null,null,null,null,null,null,null,null,null,null,null,null,null,null,null,null,null,null,null,null,null,null,null,"Freiburg","136"]
[null,null,null,null,null,null,"Sahara","137",null,null,null,null,null,null,null,null,null,null,null,null,null,null,null,null,null,null,null,null,null,null,null,null,null,null,null,null,null,null,null,null,null,null,null,null,null,null,null,null,null,null,null,null,null,null,null,null,null,null,null,null,null,null,null,"Freising","137"]
[null,null,null,null,null,null,"Salomonen","138",null,null,null,null,null,null,null,null,null,null,null,null,null,null,null,null,null,null,null,null,null,null,null,null,null,null,null,null,null,null,null,null,null,null,null,null,null,null,null,null,null,null,null,null,null,null,null,null,null,null,null,null,null,null,null,"Fribourg","138"]
[null,null,null,null,null,null,"Sambia","139",null,null,null,null,null,null,null,null,null,null,null,null,null,null,null,null,null,null,null,null,null,null,null,null,null,null,null,null,null,null,null,null,null,null,null,null,null,null,null,null,null,null,null,null,null,null,null,null,null,null,null,null,null,null,null,"Friedberg","139"]
[null,null,null,null,null,null,"Samoa","140",null,null,null,null,null,null,null,null,null,null,null,null,null,null,null,null,null,null,null,null,null,null,null,null,null,null,null,null,null,null,null,null,null,null,null,null,null,null,null,null,null,null,null,null,null,null,null,null,null,null,null,null,null,null,null,"Friedrichshafen","140"]
[null,null,null,null,null,null,"San Marino","141",null,null,null,null,null,null,null,null,null,null,null,null,null,null,null,null,null,null,null,null,null,null,null,null,null,null,null,null,null,null,null,null,null,null,null,null,null,null,null,null,null,null,null,null,null,null,null,null,null,null,null,null,null,null,null,"Fulda","141"]
[null,null,null,null,null,null,"São Tomé und Príncipe","142",null,null,null,null,null,null,null,null,null,null,null,null,null,null,null,null,null,null,null,null,null,null,null,null,null,null,null,null,null,null,null,null,null,null,null,null,null,null,null,null,null,null,null,null,null,null,null,null,null,null,null,null,null,null,null,"Furth","142"]
[null,null,null,null,null,null,"Saudi-Arabien","143",null,null,null,null,null,null,null,null,null,null,null,null,null,null,null,null,null,null,null,null,null,null,null,null,null,null,null,null,null,null,null,null,null,null,null,null,null,null,null,null,null,null,null,null,null,null,null,null,null,null,null,null,null,null,null,"Furtwangen","143"]
[null,null,null,null,null,null,"Schweden","144",null,null,null,null,null,null,null,null,null,null,null,null,null,null,null,null,null,null,null,null,null,null,null,null,null,null,null,null,null,null,null,null,null,null,null,null,null,null,null,null,null,null,null,null,null,null,null,null,null,null,null,null,null,null,null,"Gaißach","144"]
[null,null,null,null,null,null,"Schweiz","145",null,null,null,null,null,null,null,null,null,null,null,null,null,null,null,null,null,null,null,null,null,null,null,null,null,null,null,null,null,null,null,null,null,null,null,null,null,null,null,null,null,null,null,null,null,null,null,null,null,null,null,null,null,null,null,"Garching","145"]
[null,null,null,null,null,null,"Senegal","146",null,null,null,null,null,null,null,null,null,null,null,null,null,null,null,null,null,null,null,null,null,null,null,null,null,null,null,null,null,null,null,null,null,null,null,null,null,null,null,null,null,null,null,null,null,null,null,null,null,null,null,null,null,null,null,"Geilenkirchen","146"]
[null,null,null,null,null,null,"Seychellen","147",null,null,null,null,null,null,null,null,null,null,null,null,null,null,null,null,null,null,null,null,null,null,null,null,null,null,null,null,null,null,null,null,null,null,null,null,null,null,null,null,null,null,null,null,null,null,null,null,null,null,null,null,null,null,null,"Geisenheim","147"]
[null,null,null,null,null,null,"Sierra Leone","148",null,null,null,null,null,null,null,null,null,null,null,null,null,null,null,null,null,null,null,null,null,null,null,null,null,null,null,null,null,null,null,null,null,null,null,null,null,null,null,null,null,null,null,null,null,null,null,null,null,null,null,null,null,null,null,"Geislingen","148"]
[null,null,null,null,null,null,"Simbabwe","149",null,null,null,null,null,null,null,null,null,null,null,null,null,null,null,null,null,null,null,null,null,null,null,null,null,null,null,null,null,null,null,null,null,null,null,null,null,null,null,null,null,null,null,null,null,null,null,null,null,null,null,null,null,null,null,"Gelnhausen","149"]
[null,null,null,null,null,null,"Singapur","150",null,null,null,null,null,null,null,null,null,null,null,null,null,null,null,null,null,null,null,null,null,null,null,null,null,null,null,null,null,null,null,null,null,null,null,null,null,null,null,null,null,null,null,null,null,null,null,null,null,null,null,null,null,null,null,"Gelsenkirchen","150"]
[null,null,null,null,null,null,"Slowakei","151",null,null,null,null,null,null,null,null,null,null,null,null,null,null,null,null,null,null,null,null,null,null,null,null,null,null,null,null,null,null,null,null,null,null,null,null,null,null,null,null,null,null,null,null,null,null,null,null,null,null,null,null,null,null,null,"Genève","151"]
[null,null,null,null,null,null,"Slowenien","152",null,null,null,null,null,null,null,null,null,null,null,null,null,null,null,null,null,null,null,null,null,null,null,null,null,null,null,null,null,null,null,null,null,null,null,null,null,null,null,null,null,null,null,null,null,null,null,null,null,null,null,null,null,null,null,"Genf","152"]
[null,null,null,null,null,null,"Somalia","153",null,null,null,null,null,null,null,null,null,null,null,null,null,null,null,null,null,null,null,null,null,null,null,null,null,null,null,null,null,null,null,null,null,null,null,null,null,null,null,null,null,null,null,null,null,null,null,null,null,null,null,null,null,null,null,"Genova","153"]
[null,null,null,null,null,null,"sonstige",190,null,null,null,null,null,null,null,null,null,null,null,null,null,null,null,null,null,null,null,null,null,null,null,null,null,null,null,null,null,null,null,null,null,null,null,null,null,null,null,null,null,null,null,null,null,null,null,null,null,null,null,null,null,null,null,"Gerresheim","154"]
[null,null,null,null,null,null,"Spanien","154",null,null,null,null,null,null,null,null,null,null,null,null,null,null,null,null,null,null,null,null,null,null,null,null,null,null,null,null,null,null,null,null,null,null,null,null,null,null,null,null,null,null,null,null,null,null,null,null,null,null,null,null,null,null,null,"Gießen","155"]
[null,null,null,null,null,null,"Sri Lanka","155",null,null,null,null,null,null,null,null,null,null,null,null,null,null,null,null,null,null,null,null,null,null,null,null,null,null,null,null,null,null,null,null,null,null,null,null,null,null,null,null,null,null,null,null,null,null,null,null,null,null,null,null,null,null,null,"Glasgow","156"]
[null,null,null,null,null,null,"St. Kitts und Nevis","156",null,null,null,null,null,null,null,null,null,null,null,null,null,null,null,null,null,null,null,null,null,null,null,null,null,null,null,null,null,null,null,null,null,null,null,null,null,null,null,null,null,null,null,null,null,null,null,null,null,null,null,null,null,null,null,"Glauchau","157"]
[null,null,null,null,null,null,"St. Lucia","157",null,null,null,null,null,null,null,null,null,null,null,null,null,null,null,null,null,null,null,null,null,null,null,null,null,null,null,null,null,null,null,null,null,null,null,null,null,null,null,null,null,null,null,null,null,null,null,null,null,null,null,null,null,null,null,"Göppingen","158"]
[null,null,null,null,null,null,"St. Vincent und die Grenadinen","158",null,null,null,null,null,null,null,null,null,null,null,null,null,null,null,null,null,null,null,null,null,null,null,null,null,null,null,null,null,null,null,null,null,null,null,null,null,null,null,null,null,null,null,null,null,null,null,null,null,null,null,null,null,null,null,"Goslar","159"]
[null,null,null,null,null,null,"Südafrika","159",null,null,null,null,null,null,null,null,null,null,null,null,null,null,null,null,null,null,null,null,null,null,null,null,null,null,null,null,null,null,null,null,null,null,null,null,null,null,null,null,null,null,null,null,null,null,null,null,null,null,null,null,null,null,null,"Göttingen","160"]
[null,null,null,null,null,null,"Sudan","160",null,null,null,null,null,null,null,null,null,null,null,null,null,null,null,null,null,null,null,null,null,null,null,null,null,null,null,null,null,null,null,null,null,null,null,null,null,null,null,null,null,null,null,null,null,null,null,null,null,null,null,null,null,null,null,"Granada","161"]
[null,null,null,null,null,null,"Suriname","161",null,null,null,null,null,null,null,null,null,null,null,null,null,null,null,null,null,null,null,null,null,null,null,null,null,null,null,null,null,null,null,null,null,null,null,null,null,null,null,null,null,null,null,null,null,null,null,null,null,null,null,null,null,null,null,"Graz","162"]
[null,null,null,null,null,null,"Swasiland","162",null,null,null,null,null,null,null,null,null,null,null,null,null,null,null,null,null,null,null,null,null,null,null,null,null,null,null,null,null,null,null,null,null,null,null,null,null,null,null,null,null,null,null,null,null,null,null,null,null,null,null,null,null,null,null,"Greifswald","163"]
[null,null,null,null,null,null,"Syrien","163",null,null,null,null,null,null,null,null,null,null,null,null,null,null,null,null,null,null,null,null,null,null,null,null,null,null,null,null,null,null,null,null,null,null,null,null,null,null,null,null,null,null,null,null,null,null,null,null,null,null,null,null,null,null,null,"Grenchen","164"]
[null,null,null,null,null,null,"Tadschikistan","164",null,null,null,null,null,null,null,null,null,null,null,null,null,null,null,null,null,null,null,null,null,null,null,null,null,null,null,null,null,null,null,null,null,null,null,null,null,null,null,null,null,null,null,null,null,null,null,null,null,null,null,null,null,null,null,"Grenzhausen","165"]
[null,null,null,null,null,null,"Tansania","165",null,null,null,null,null,null,null,null,null,null,null,null,null,null,null,null,null,null,null,null,null,null,null,null,null,null,null,null,null,null,null,null,null,null,null,null,null,null,null,null,null,null,null,null,null,null,null,null,null,null,null,null,null,null,null,"Groningen","166"]
[null,null,null,null,null,null,"Thailand","166",null,null,null,null,null,null,null,null,null,null,null,null,null,null,null,null,null,null,null,null,null,null,null,null,null,null,null,null,null,null,null,null,null,null,null,null,null,null,null,null,null,null,null,null,null,null,null,null,null,null,null,null,null,null,null,"Grunewald","167"]
[null,null,null,null,null,null,"Togo","167",null,null,null,null,null,null,null,null,null,null,null,null,null,null,null,null,null,null,null,null,null,null,null,null,null,null,null,null,null,null,null,null,null,null,null,null,null,null,null,null,null,null,null,null,null,null,null,null,null,null,null,null,null,null,null,"Gummersbach","168"]
[null,null,null,null,null,null,"Tonga","168",null,null,null,null,null,null,null,null,null,null,null,null,null,null,null,null,null,null,null,null,null,null,null,null,null,null,null,null,null,null,null,null,null,null,null,null,null,null,null,null,null,null,null,null,null,null,null,null,null,null,null,null,null,null,null,"Güstrow","169"]
[null,null,null,null,null,null,"Trinidad und Tobago","169",null,null,null,null,null,null,null,null,null,null,null,null,null,null,null,null,null,null,null,null,null,null,null,null,null,null,null,null,null,null,null,null,null,null,null,null,null,null,null,null,null,null,null,null,null,null,null,null,null,null,null,null,null,null,null,"Habichtswald","170"]
[null,null,null,null,null,null,"Tschad","170",null,null,null,null,null,null,null,null,null,null,null,null,null,null,null,null,null,null,null,null,null,null,null,null,null,null,null,null,null,null,null,null,null,null,null,null,null,null,null,null,null,null,null,null,null,null,null,null,null,null,null,null,null,null,null,"Hachenburg","171"]
[null,null,null,null,null,null,"Tschechische Republik","171",null,null,null,null,null,null,null,null,null,null,null,null,null,null,null,null,null,null,null,null,null,null,null,null,null,null,null,null,null,null,null,null,null,null,null,null,null,null,null,null,null,null,null,null,null,null,null,null,null,null,null,null,null,null,null,"Hagen","172"]
[null,null,null,null,null,null,"Tunesien","172",null,null,null,null,null,null,null,null,null,null,null,null,null,null,null,null,null,null,null,null,null,null,null,null,null,null,null,null,null,null,null,null,null,null,null,null,null,null,null,null,null,null,null,null,null,null,null,null,null,null,null,null,null,null,null,"Hagenberg","173"]
[null,null,null,null,null,null,"Türkei","173",null,null,null,null,null,null,null,null,null,null,null,null,null,null,null,null,null,null,null,null,null,null,null,null,null,null,null,null,null,null,null,null,null,null,null,null,null,null,null,null,null,null,null,null,null,null,null,null,null,null,null,null,null,null,null,"Hainberg","174"]
[null,null,null,null,null,null,"Turmenistan","174",null,null,null,null,null,null,null,null,null,null,null,null,null,null,null,null,null,null,null,null,null,null,null,null,null,null,null,null,null,null,null,null,null,null,null,null,null,null,null,null,null,null,null,null,null,null,null,null,null,null,null,null,null,null,null,"Halle","175"]
[null,null,null,null,null,null,"Tuvalu","175",null,null,null,null,null,null,null,null,null,null,null,null,null,null,null,null,null,null,null,null,null,null,null,null,null,null,null,null,null,null,null,null,null,null,null,null,null,null,null,null,null,null,null,null,null,null,null,null,null,null,null,null,null,null,null,"Hamburg","176"]
[null,null,null,null,null,null,"Uganda","176",null,null,null,null,null,null,null,null,null,null,null,null,null,null,null,null,null,null,null,null,null,null,null,null,null,null,null,null,null,null,null,null,null,null,null,null,null,null,null,null,null,null,null,null,null,null,null,null,null,null,null,null,null,null,null,"Hameln","177"]
[null,null,null,null,null,null,"Ukraine","177",null,null,null,null,null,null,null,null,null,null,null,null,null,null,null,null,null,null,null,null,null,null,null,null,null,null,null,null,null,null,null,null,null,null,null,null,null,null,null,null,null,null,null,null,null,null,null,null,null,null,null,null,null,null,null,"Hamm","178"]
[null,null,null,null,null,null,"Ungarn","178",null,null,null,null,null,null,null,null,null,null,null,null,null,null,null,null,null,null,null,null,null,null,null,null,null,null,null,null,null,null,null,null,null,null,null,null,null,null,null,null,null,null,null,null,null,null,null,null,null,null,null,null,null,null,null,"Hannover","179"]
[null,null,null,null,null,null,"Uruguay","179",null,null,null,null,null,null,null,null,null,null,null,null,null,null,null,null,null,null,null,null,null,null,null,null,null,null,null,null,null,null,null,null,null,null,null,null,null,null,null,null,null,null,null,null,null,null,null,null,null,null,null,null,null,null,null,"Harburg","180"]
[null,null,null,null,null,null,"Usbekistan","180",null,null,null,null,null,null,null,null,null,null,null,null,null,null,null,null,null,null,null,null,null,null,null,null,null,null,null,null,null,null,null,null,null,null,null,null,null,null,null,null,null,null,null,null,null,null,null,null,null,null,null,null,null,null,null,"Hattingen","181"]
[null,null,null,null,null,null,"Vanatu","181",null,null,null,null,null,null,null,null,null,null,null,null,null,null,null,null,null,null,null,null,null,null,null,null,null,null,null,null,null,null,null,null,null,null,null,null,null,null,null,null,null,null,null,null,null,null,null,null,null,null,null,null,null,null,null,"Heide","182"]
[null,null,null,null,null,null,"Vatikanstadt","182",null,null,null,null,null,null,null,null,null,null,null,null,null,null,null,null,null,null,null,null,null,null,null,null,null,null,null,null,null,null,null,null,null,null,null,null,null,null,null,null,null,null,null,null,null,null,null,null,null,null,null,null,null,null,null,"Heidelberg","183"]
[null,null,null,null,null,null,"Venezuela","183",null,null,null,null,null,null,null,null,null,null,null,null,null,null,null,null,null,null,null,null,null,null,null,null,null,null,null,null,null,null,null,null,null,null,null,null,null,null,null,null,null,null,null,null,null,null,null,null,null,null,null,null,null,null,null,"Heidenheim","184"]
[null,null,null,null,null,null,"Vereinigte Arabische Emirate","184",null,null,null,null,null,null,null,null,null,null,null,null,null,null,null,null,null,null,null,null,null,null,null,null,null,null,null,null,null,null,null,null,null,null,null,null,null,null,null,null,null,null,null,null,null,null,null,null,null,null,null,null,null,null,null,"Heilbronn","185"]
[null,null,null,null,null,null,"Vereinigte Staaten von Amerika","185",null,null,null,null,null,null,null,null,null,null,null,null,null,null,null,null,null,null,null,null,null,null,null,null,null,null,null,null,null,null,null,null,null,null,null,null,null,null,null,null,null,null,null,null,null,null,null,null,null,null,null,null,null,null,null,"Helmstedt","186"]
[null,null,null,null,null,null,"Vietnam","186",null,null,null,null,null,null,null,null,null,null,null,null,null,null,null,null,null,null,null,null,null,null,null,null,null,null,null,null,null,null,null,null,null,null,null,null,null,null,null,null,null,null,null,null,null,null,null,null,null,null,null,null,null,null,null,"Herdecke","187"]
[null,null,null,null,null,null,"Weißrußland","187",null,null,null,null,null,null,null,null,null,null,null,null,null,null,null,null,null,null,null,null,null,null,null,null,null,null,null,null,null,null,null,null,null,null,null,null,null,null,null,null,null,null,null,null,null,null,null,null,null,null,null,null,null,null,null,"Herford","188"]
[null,null,null,null,null,null,"Zentralafrikanische Republik","188",null,null,null,null,null,null,null,null,null,null,null,null,null,null,null,null,null,null,null,null,null,null,null,null,null,null,null,null,null,null,null,null,null,null,null,null,null,null,null,null,null,null,null,null,null,null,null,null,null,null,null,null,null,null,null,"Herne","189"]
[null,null,null,null,null,null,"Zypern","189",null,null,null,null,null,null,null,null,null,null,null,null,null,null,null,null,null,null,null,null,null,null,null,null,null,null,null,null,null,null,null,null,null,null,null,null,null,null,null,null,null,null,null,null,null,null,null,null,null,null,null,null,null,null,null,"Hildesheim","190"]
[null,null,null,null,null,null,"sonstige",190,null,null,null,null,null,null,null,null,null,null,null,null,null,null,null,null,null,null,null,null,null,null,null,null,null,null,null,null,null,null,null,null,null,null,null,null,null,null,null,null,null,null,null,null,null,null,null,null,null,null,null,null,null,null,null,"Hof","191"]
[null,null,null,null,null,null,0,{"$f":"\"\"","v":""},null,null,null,null,null,null,null,null,null,null,null,null,null,null,null,null,null,null,null,null,null,null,null,null,null,null,null,null,null,null,null,null,null,null,null,null,null,null,null,null,null,null,null,null,null,null,null,null,null,null,null,null,null,null,null,"Hohenheim","192"]
[null,null,null,null,null,null,null,null,null,null,null,null,null,null,null,null,null,null,null,null,null,null,null,null,null,null,null,null,null,null,null,null,null,null,null,null,null,null,null,null,null,null,null,null,null,null,null,null,null,null,null,null,null,null,null,null,null,null,null,null,null,null,null,"Hohenlohe","193"]
[null,null,null,null,null,null,null,null,null,null,null,null,null,null,null,null,null,null,null,null,null,null,null,null,null,null,null,null,null,null,null,null,null,null,null,null,null,null,null,null,null,null,null,null,null,null,null,null,null,null,null,null,null,null,null,null,null,null,null,null,null,null,null,"Höhr","194"]
[null,null,null,null,null,null,null,null,null,null,null,null,null,null,null,null,null,null,null,null,null,null,null,null,null,null,null,null,null,null,null,null,null,null,null,null,null,null,null,null,null,null,null,null,null,null,null,null,null,null,null,null,null,null,null,null,null,null,null,null,null,null,null,"Holzminden","195"]
[null,null,null,null,null,null,null,null,null,null,null,null,null,null,null,null,null,null,null,null,null,null,null,null,null,null,null,null,null,null,null,null,null,null,null,null,null,null,null,null,null,null,null,null,null,null,null,null,null,null,null,null,null,null,null,null,null,null,null,null,null,null,null,"Homburg","196"]
[null,null,null,null,null,null,null,null,null,null,null,null,null,null,null,null,null,null,null,null,null,null,null,null,null,null,null,null,null,null,null,null,null,null,null,null,null,null,null,null,null,null,null,null,null,null,null,null,null,null,null,null,null,null,null,null,null,null,null,null,null,null,null,"Horb","197"]
[null,null,null,null,null,null,null,null,null,null,null,null,null,null,null,null,null,null,null,null,null,null,null,null,null,null,null,null,null,null,null,null,null,null,null,null,null,null,null,null,null,null,null,null,null,null,null,null,null,null,null,null,null,null,null,null,null,null,null,null,null,null,null,"Höxter","198"]
[null,null,null,null,null,null,null,null,null,null,null,null,null,null,null,null,null,null,null,null,null,null,null,null,null,null,null,null,null,null,null,null,null,null,null,null,null,null,null,null,null,null,null,null,null,null,null,null,null,null,null,null,null,null,null,null,null,null,null,null,null,null,null,"Idar","199"]
[null,null,null,null,null,null,null,null,null,null,null,null,null,null,null,null,null,null,null,null,null,null,null,null,null,null,null,null,null,null,null,null,null,null,null,null,null,null,null,null,null,null,null,null,null,null,null,null,null,null,null,null,null,null,null,null,null,null,null,null,null,null,null,"Idstein","200"]
[null,null,null,null,null,null,null,null,null,null,null,null,null,null,null,null,null,null,null,null,null,null,null,null,null,null,null,null,null,null,null,null,null,null,null,null,null,null,null,null,null,null,null,null,null,null,null,null,null,null,null,null,null,null,null,null,null,null,null,null,null,null,null,"Ilmenau","201"]
[null,null,null,null,null,null,null,null,null,null,null,null,null,null,null,null,null,null,null,null,null,null,null,null,null,null,null,null,null,null,null,null,null,null,null,null,null,null,null,null,null,null,null,null,null,null,null,null,null,null,null,null,null,null,null,null,null,null,null,null,null,null,null,"Ingolstadt","202"]
[null,null,null,null,null,null,null,null,null,null,null,null,null,null,null,null,null,null,null,null,null,null,null,null,null,null,null,null,null,null,null,null,null,null,null,null,null,null,null,null,null,null,null,null,null,null,null,null,null,null,null,null,null,null,null,null,null,null,null,null,null,null,null,"Innsbruck","203"]
[null,null,null,null,null,null,null,null,null,null,null,null,null,null,null,null,null,null,null,null,null,null,null,null,null,null,null,null,null,null,null,null,null,null,null,null,null,null,null,null,null,null,null,null,null,null,null,null,null,null,null,null,null,null,null,null,null,null,null,null,null,null,null,"Iserlohn","204"]
[null,null,null,null,null,null,null,null,null,null,null,null,null,null,null,null,null,null,null,null,null,null,null,null,null,null,null,null,null,null,null,null,null,null,null,null,null,null,null,null,null,null,null,null,null,null,null,null,null,null,null,null,null,null,null,null,null,null,null,null,null,null,null,"Isny","205"]
[null,null,null,null,null,null,null,null,null,null,null,null,null,null,null,null,null,null,null,null,null,null,null,null,null,null,null,null,null,null,null,null,null,null,null,null,null,null,null,null,null,null,null,null,null,null,null,null,null,null,null,null,null,null,null,null,null,null,null,null,null,null,null,"Itzehoe","206"]
[null,null,null,null,null,null,null,null,null,null,null,null,null,null,null,null,null,null,null,null,null,null,null,null,null,null,null,null,null,null,null,null,null,null,null,null,null,null,null,null,null,null,null,null,null,null,null,null,null,null,null,null,null,null,null,null,null,null,null,null,null,null,null,"Jena","207"]
[null,null,null,null,null,null,null,null,null,null,null,null,null,null,null,null,null,null,null,null,null,null,null,null,null,null,null,null,null,null,null,null,null,null,null,null,null,null,null,null,null,null,null,null,null,null,null,null,null,null,null,null,null,null,null,null,null,null,null,null,null,null,null,"Johannesbad","208"]
[null,null,null,null,null,null,null,null,null,null,null,null,null,null,null,null,null,null,null,null,null,null,null,null,null,null,null,null,null,null,null,null,null,null,null,null,null,null,null,null,null,null,null,null,null,null,null,null,null,null,null,null,null,null,null,null,null,null,null,null,null,null,null,"Jülich","209"]
[null,null,null,null,null,null,null,null,null,null,null,null,null,null,null,null,null,null,null,null,null,null,null,null,null,null,null,null,null,null,null,null,null,null,null,null,null,null,null,null,null,null,null,null,null,null,null,null,null,null,null,null,null,null,null,null,null,null,null,null,null,null,null,"Kaiserhof","210"]
[null,null,null,null,null,null,null,null,null,null,null,null,null,null,null,null,null,null,null,null,null,null,null,null,null,null,null,null,null,null,null,null,null,null,null,null,null,null,null,null,null,null,null,null,null,null,null,null,null,null,null,null,null,null,null,null,null,null,null,null,null,null,null,"Kaiserslautern","211"]
[null,null,null,null,null,null,null,null,null,null,null,null,null,null,null,null,null,null,null,null,null,null,null,null,null,null,null,null,null,null,null,null,null,null,null,null,null,null,null,null,null,null,null,null,null,null,null,null,null,null,null,null,null,null,null,null,null,null,null,null,null,null,null,"Kapfenberg","212"]
[null,null,null,null,null,null,null,null,null,null,null,null,null,null,null,null,null,null,null,null,null,null,null,null,null,null,null,null,null,null,null,null,null,null,null,null,null,null,null,null,null,null,null,null,null,null,null,null,null,null,null,null,null,null,null,null,null,null,null,null,null,null,null,"Karlsbad","213"]
[null,null,null,null,null,null,null,null,null,null,null,null,null,null,null,null,null,null,null,null,null,null,null,null,null,null,null,null,null,null,null,null,null,null,null,null,null,null,null,null,null,null,null,null,null,null,null,null,null,null,null,null,null,null,null,null,null,null,null,null,null,null,null,"Karlsruhe","214"]
[null,null,null,null,null,null,null,null,null,null,null,null,null,null,null,null,null,null,null,null,null,null,null,null,null,null,null,null,null,null,null,null,null,null,null,null,null,null,null,null,null,null,null,null,null,null,null,null,null,null,null,null,null,null,null,null,null,null,null,null,null,null,null,"Kassel","215"]
[null,null,null,null,null,null,null,null,null,null,null,null,null,null,null,null,null,null,null,null,null,null,null,null,null,null,null,null,null,null,null,null,null,null,null,null,null,null,null,null,null,null,null,null,null,null,null,null,null,null,null,null,null,null,null,null,null,null,null,null,null,null,null,"Kemperhof","216"]
[null,null,null,null,null,null,null,null,null,null,null,null,null,null,null,null,null,null,null,null,null,null,null,null,null,null,null,null,null,null,null,null,null,null,null,null,null,null,null,null,null,null,null,null,null,null,null,null,null,null,null,null,null,null,null,null,null,null,null,null,null,null,null,"Kempten","217"]
[null,null,null,null,null,null,null,null,null,null,null,null,null,null,null,null,null,null,null,null,null,null,null,null,null,null,null,null,null,null,null,null,null,null,null,null,null,null,null,null,null,null,null,null,null,null,null,null,null,null,null,null,null,null,null,null,null,null,null,null,null,null,null,"Kiel","218"]
[null,null,null,null,null,null,null,null,null,null,null,null,null,null,null,null,null,null,null,null,null,null,null,null,null,null,null,null,null,null,null,null,null,null,null,null,null,null,null,null,null,null,null,null,null,null,null,null,null,null,null,null,null,null,null,null,null,null,null,null,null,null,null,"Klagenfurt","219"]
[null,null,null,null,null,null,null,null,null,null,null,null,null,null,null,null,null,null,null,null,null,null,null,null,null,null,null,null,null,null,null,null,null,null,null,null,null,null,null,null,null,null,null,null,null,null,null,null,null,null,null,null,null,null,null,null,null,null,null,null,null,null,null,"Koblenz","220"]
[null,null,null,null,null,null,null,null,null,null,null,null,null,null,null,null,null,null,null,null,null,null,null,null,null,null,null,null,null,null,null,null,null,null,null,null,null,null,null,null,null,null,null,null,null,null,null,null,null,null,null,null,null,null,null,null,null,null,null,null,null,null,null,"Köln","221"]
[null,null,null,null,null,null,null,null,null,null,null,null,null,null,null,null,null,null,null,null,null,null,null,null,null,null,null,null,null,null,null,null,null,null,null,null,null,null,null,null,null,null,null,null,null,null,null,null,null,null,null,null,null,null,null,null,null,null,null,null,null,null,null,"Konstanz","222"]
[null,null,null,null,null,null,null,null,null,null,null,null,null,null,null,null,null,null,null,null,null,null,null,null,null,null,null,null,null,null,null,null,null,null,null,null,null,null,null,null,null,null,null,null,null,null,null,null,null,null,null,null,null,null,null,null,null,null,null,null,null,null,null,"Köthen","223"]
[null,null,null,null,null,null,null,null,null,null,null,null,null,null,null,null,null,null,null,null,null,null,null,null,null,null,null,null,null,null,null,null,null,null,null,null,null,null,null,null,null,null,null,null,null,null,null,null,null,null,null,null,null,null,null,null,null,null,null,null,null,null,null,"Krefeld","224"]
[null,null,null,null,null,null,null,null,null,null,null,null,null,null,null,null,null,null,null,null,null,null,null,null,null,null,null,null,null,null,null,null,null,null,null,null,null,null,null,null,null,null,null,null,null,null,null,null,null,null,null,null,null,null,null,null,null,null,null,null,null,null,null,"Krems","225"]
[null,null,null,null,null,null,null,null,null,null,null,null,null,null,null,null,null,null,null,null,null,null,null,null,null,null,null,null,null,null,null,null,null,null,null,null,null,null,null,null,null,null,null,null,null,null,null,null,null,null,null,null,null,null,null,null,null,null,null,null,null,null,null,"Kuchl","226"]
[null,null,null,null,null,null,null,null,null,null,null,null,null,null,null,null,null,null,null,null,null,null,null,null,null,null,null,null,null,null,null,null,null,null,null,null,null,null,null,null,null,null,null,null,null,null,null,null,null,null,null,null,null,null,null,null,null,null,null,null,null,null,null,"Kufstein","227"]
[null,null,null,null,null,null,null,null,null,null,null,null,null,null,null,null,null,null,null,null,null,null,null,null,null,null,null,null,null,null,null,null,null,null,null,null,null,null,null,null,null,null,null,null,null,null,null,null,null,null,null,null,null,null,null,null,null,null,null,null,null,null,null,"Künzelsau","228"]
[null,null,null,null,null,null,null,null,null,null,null,null,null,null,null,null,null,null,null,null,null,null,null,null,null,null,null,null,null,null,null,null,null,null,null,null,null,null,null,null,null,null,null,null,null,null,null,null,null,null,null,null,null,null,null,null,null,null,null,null,null,null,null,"L´Aquila","229"]
[null,null,null,null,null,null,null,null,null,null,null,null,null,null,null,null,null,null,null,null,null,null,null,null,null,null,null,null,null,null,null,null,null,null,null,null,null,null,null,null,null,null,null,null,null,null,null,null,null,null,null,null,null,null,null,null,null,null,null,null,null,null,null,"Laguna","230"]
[null,null,null,null,null,null,null,null,null,null,null,null,null,null,null,null,null,null,null,null,null,null,null,null,null,null,null,null,null,null,null,null,null,null,null,null,null,null,null,null,null,null,null,null,null,null,null,null,null,null,null,null,null,null,null,null,null,null,null,null,null,null,null,"Lahr","231"]
[null,null,null,null,null,null,null,null,null,null,null,null,null,null,null,null,null,null,null,null,null,null,null,null,null,null,null,null,null,null,null,null,null,null,null,null,null,null,null,null,null,null,null,null,null,null,null,null,null,null,null,null,null,null,null,null,null,null,null,null,null,null,null,"Landau","232"]
[null,null,null,null,null,null,null,null,null,null,null,null,null,null,null,null,null,null,null,null,null,null,null,null,null,null,null,null,null,null,null,null,null,null,null,null,null,null,null,null,null,null,null,null,null,null,null,null,null,null,null,null,null,null,null,null,null,null,null,null,null,null,null,"Landshut","233"]
[null,null,null,null,null,null,null,null,null,null,null,null,null,null,null,null,null,null,null,null,null,null,null,null,null,null,null,null,null,null,null,null,null,null,null,null,null,null,null,null,null,null,null,null,null,null,null,null,null,null,null,null,null,null,null,null,null,null,null,null,null,null,null,"Laupheim","234"]
[null,null,null,null,null,null,null,null,null,null,null,null,null,null,null,null,null,null,null,null,null,null,null,null,null,null,null,null,null,null,null,null,null,null,null,null,null,null,null,null,null,null,null,null,null,null,null,null,null,null,null,null,null,null,null,null,null,null,null,null,null,null,null,"Lausanne","235"]
[null,null,null,null,null,null,null,null,null,null,null,null,null,null,null,null,null,null,null,null,null,null,null,null,null,null,null,null,null,null,null,null,null,null,null,null,null,null,null,null,null,null,null,null,null,null,null,null,null,null,null,null,null,null,null,null,null,null,null,null,null,null,null,"Lausitz","236"]
[null,null,null,null,null,null,null,null,null,null,null,null,null,null,null,null,null,null,null,null,null,null,null,null,null,null,null,null,null,null,null,null,null,null,null,null,null,null,null,null,null,null,null,null,null,null,null,null,null,null,null,null,null,null,null,null,null,null,null,null,null,null,null,"Lautzen","237"]
[null,null,null,null,null,null,null,null,null,null,null,null,null,null,null,null,null,null,null,null,null,null,null,null,null,null,null,null,null,null,null,null,null,null,null,null,null,null,null,null,null,null,null,null,null,null,null,null,null,null,null,null,null,null,null,null,null,null,null,null,null,null,null,"Leeds","238"]
[null,null,null,null,null,null,null,null,null,null,null,null,null,null,null,null,null,null,null,null,null,null,null,null,null,null,null,null,null,null,null,null,null,null,null,null,null,null,null,null,null,null,null,null,null,null,null,null,null,null,null,null,null,null,null,null,null,null,null,null,null,null,null,"Leer","239"]
[null,null,null,null,null,null,null,null,null,null,null,null,null,null,null,null,null,null,null,null,null,null,null,null,null,null,null,null,null,null,null,null,null,null,null,null,null,null,null,null,null,null,null,null,null,null,null,null,null,null,null,null,null,null,null,null,null,null,null,null,null,null,null,"Leicester","240"]
[null,null,null,null,null,null,null,null,null,null,null,null,null,null,null,null,null,null,null,null,null,null,null,null,null,null,null,null,null,null,null,null,null,null,null,null,null,null,null,null,null,null,null,null,null,null,null,null,null,null,null,null,null,null,null,null,null,null,null,null,null,null,null,"Leiden","241"]
[null,null,null,null,null,null,null,null,null,null,null,null,null,null,null,null,null,null,null,null,null,null,null,null,null,null,null,null,null,null,null,null,null,null,null,null,null,null,null,null,null,null,null,null,null,null,null,null,null,null,null,null,null,null,null,null,null,null,null,null,null,null,null,"Leipzig","242"]
[null,null,null,null,null,null,null,null,null,null,null,null,null,null,null,null,null,null,null,null,null,null,null,null,null,null,null,null,null,null,null,null,null,null,null,null,null,null,null,null,null,null,null,null,null,null,null,null,null,null,null,null,null,null,null,null,null,null,null,null,null,null,null,"Lemgo","243"]
[null,null,null,null,null,null,null,null,null,null,null,null,null,null,null,null,null,null,null,null,null,null,null,null,null,null,null,null,null,null,null,null,null,null,null,null,null,null,null,null,null,null,null,null,null,null,null,null,null,null,null,null,null,null,null,null,null,null,null,null,null,null,null,"Leoben","244"]
[null,null,null,null,null,null,null,null,null,null,null,null,null,null,null,null,null,null,null,null,null,null,null,null,null,null,null,null,null,null,null,null,null,null,null,null,null,null,null,null,null,null,null,null,null,null,null,null,null,null,null,null,null,null,null,null,null,null,null,null,null,null,null,"Leuna","245"]
[null,null,null,null,null,null,null,null,null,null,null,null,null,null,null,null,null,null,null,null,null,null,null,null,null,null,null,null,null,null,null,null,null,null,null,null,null,null,null,null,null,null,null,null,null,null,null,null,null,null,null,null,null,null,null,null,null,null,null,null,null,null,null,"Leverkusen","246"]
[null,null,null,null,null,null,null,null,null,null,null,null,null,null,null,null,null,null,null,null,null,null,null,null,null,null,null,null,null,null,null,null,null,null,null,null,null,null,null,null,null,null,null,null,null,null,null,null,null,null,null,null,null,null,null,null,null,null,null,null,null,null,null,"Lich","247"]
[null,null,null,null,null,null,null,null,null,null,null,null,null,null,null,null,null,null,null,null,null,null,null,null,null,null,null,null,null,null,null,null,null,null,null,null,null,null,null,null,null,null,null,null,null,null,null,null,null,null,null,null,null,null,null,null,null,null,null,null,null,null,null,"Lichtenau","248"]
[null,null,null,null,null,null,null,null,null,null,null,null,null,null,null,null,null,null,null,null,null,null,null,null,null,null,null,null,null,null,null,null,null,null,null,null,null,null,null,null,null,null,null,null,null,null,null,null,null,null,null,null,null,null,null,null,null,null,null,null,null,null,null,"Liechtenstein","249"]
[null,null,null,null,null,null,null,null,null,null,null,null,null,null,null,null,null,null,null,null,null,null,null,null,null,null,null,null,null,null,null,null,null,null,null,null,null,null,null,null,null,null,null,null,null,null,null,null,null,null,null,null,null,null,null,null,null,null,null,null,null,null,null,"Limburg","250"]
[null,null,null,null,null,null,null,null,null,null,null,null,null,null,null,null,null,null,null,null,null,null,null,null,null,null,null,null,null,null,null,null,null,null,null,null,null,null,null,null,null,null,null,null,null,null,null,null,null,null,null,null,null,null,null,null,null,null,null,null,null,null,null,"Lingen","251"]
[null,null,null,null,null,null,null,null,null,null,null,null,null,null,null,null,null,null,null,null,null,null,null,null,null,null,null,null,null,null,null,null,null,null,null,null,null,null,null,null,null,null,null,null,null,null,null,null,null,null,null,null,null,null,null,null,null,null,null,null,null,null,null,"Linz","252"]
[null,null,null,null,null,null,null,null,null,null,null,null,null,null,null,null,null,null,null,null,null,null,null,null,null,null,null,null,null,null,null,null,null,null,null,null,null,null,null,null,null,null,null,null,null,null,null,null,null,null,null,null,null,null,null,null,null,null,null,null,null,null,null,"Lippe","253"]
[null,null,null,null,null,null,null,null,null,null,null,null,null,null,null,null,null,null,null,null,null,null,null,null,null,null,null,null,null,null,null,null,null,null,null,null,null,null,null,null,null,null,null,null,null,null,null,null,null,null,null,null,null,null,null,null,null,null,null,null,null,null,null,"Lippstadt","254"]
[null,null,null,null,null,null,null,null,null,null,null,null,null,null,null,null,null,null,null,null,null,null,null,null,null,null,null,null,null,null,null,null,null,null,null,null,null,null,null,null,null,null,null,null,null,null,null,null,null,null,null,null,null,null,null,null,null,null,null,null,null,null,null,"Liverpool","255"]
[null,null,null,null,null,null,null,null,null,null,null,null,null,null,null,null,null,null,null,null,null,null,null,null,null,null,null,null,null,null,null,null,null,null,null,null,null,null,null,null,null,null,null,null,null,null,null,null,null,null,null,null,null,null,null,null,null,null,null,null,null,null,null,"London","256"]
[null,null,null,null,null,null,null,null,null,null,null,null,null,null,null,null,null,null,null,null,null,null,null,null,null,null,null,null,null,null,null,null,null,null,null,null,null,null,null,null,null,null,null,null,null,null,null,null,null,null,null,null,null,null,null,null,null,null,null,null,null,null,null,"Lörrach","257"]
[null,null,null,null,null,null,null,null,null,null,null,null,null,null,null,null,null,null,null,null,null,null,null,null,null,null,null,null,null,null,null,null,null,null,null,null,null,null,null,null,null,null,null,null,null,null,null,null,null,null,null,null,null,null,null,null,null,null,null,null,null,null,null,"Lübeck","258"]
[null,null,null,null,null,null,null,null,null,null,null,null,null,null,null,null,null,null,null,null,null,null,null,null,null,null,null,null,null,null,null,null,null,null,null,null,null,null,null,null,null,null,null,null,null,null,null,null,null,null,null,null,null,null,null,null,null,null,null,null,null,null,null,"Lüdenscheid","259"]
[null,null,null,null,null,null,null,null,null,null,null,null,null,null,null,null,null,null,null,null,null,null,null,null,null,null,null,null,null,null,null,null,null,null,null,null,null,null,null,null,null,null,null,null,null,null,null,null,null,null,null,null,null,null,null,null,null,null,null,null,null,null,null,"Ludwigsburg","260"]
[null,null,null,null,null,null,null,null,null,null,null,null,null,null,null,null,null,null,null,null,null,null,null,null,null,null,null,null,null,null,null,null,null,null,null,null,null,null,null,null,null,null,null,null,null,null,null,null,null,null,null,null,null,null,null,null,null,null,null,null,null,null,null,"Ludwigshafen","261"]
[null,null,null,null,null,null,null,null,null,null,null,null,null,null,null,null,null,null,null,null,null,null,null,null,null,null,null,null,null,null,null,null,null,null,null,null,null,null,null,null,null,null,null,null,null,null,null,null,null,null,null,null,null,null,null,null,null,null,null,null,null,null,null,"Lugano","262"]
[null,null,null,null,null,null,null,null,null,null,null,null,null,null,null,null,null,null,null,null,null,null,null,null,null,null,null,null,null,null,null,null,null,null,null,null,null,null,null,null,null,null,null,null,null,null,null,null,null,null,null,null,null,null,null,null,null,null,null,null,null,null,null,"Lüneburg","263"]
[null,null,null,null,null,null,null,null,null,null,null,null,null,null,null,null,null,null,null,null,null,null,null,null,null,null,null,null,null,null,null,null,null,null,null,null,null,null,null,null,null,null,null,null,null,null,null,null,null,null,null,null,null,null,null,null,null,null,null,null,null,null,null,"Luzern","264"]
[null,null,null,null,null,null,null,null,null,null,null,null,null,null,null,null,null,null,null,null,null,null,null,null,null,null,null,null,null,null,null,null,null,null,null,null,null,null,null,null,null,null,null,null,null,null,null,null,null,null,null,null,null,null,null,null,null,null,null,null,null,null,null,"Maastricht","265"]
[null,null,null,null,null,null,null,null,null,null,null,null,null,null,null,null,null,null,null,null,null,null,null,null,null,null,null,null,null,null,null,null,null,null,null,null,null,null,null,null,null,null,null,null,null,null,null,null,null,null,null,null,null,null,null,null,null,null,null,null,null,null,null,"Madrid","266"]
[null,null,null,null,null,null,null,null,null,null,null,null,null,null,null,null,null,null,null,null,null,null,null,null,null,null,null,null,null,null,null,null,null,null,null,null,null,null,null,null,null,null,null,null,null,null,null,null,null,null,null,null,null,null,null,null,null,null,null,null,null,null,null,"Magdeburg","267"]
[null,null,null,null,null,null,null,null,null,null,null,null,null,null,null,null,null,null,null,null,null,null,null,null,null,null,null,null,null,null,null,null,null,null,null,null,null,null,null,null,null,null,null,null,null,null,null,null,null,null,null,null,null,null,null,null,null,null,null,null,null,null,null,"Mainz","268"]
[null,null,null,null,null,null,null,null,null,null,null,null,null,null,null,null,null,null,null,null,null,null,null,null,null,null,null,null,null,null,null,null,null,null,null,null,null,null,null,null,null,null,null,null,null,null,null,null,null,null,null,null,null,null,null,null,null,null,null,null,null,null,null,"Málaga","269"]
[null,null,null,null,null,null,null,null,null,null,null,null,null,null,null,null,null,null,null,null,null,null,null,null,null,null,null,null,null,null,null,null,null,null,null,null,null,null,null,null,null,null,null,null,null,null,null,null,null,null,null,null,null,null,null,null,null,null,null,null,null,null,null,"Mannheim","270"]
[null,null,null,null,null,null,null,null,null,null,null,null,null,null,null,null,null,null,null,null,null,null,null,null,null,null,null,null,null,null,null,null,null,null,null,null,null,null,null,null,null,null,null,null,null,null,null,null,null,null,null,null,null,null,null,null,null,null,null,null,null,null,null,"Marburg","271"]
[null,null,null,null,null,null,null,null,null,null,null,null,null,null,null,null,null,null,null,null,null,null,null,null,null,null,null,null,null,null,null,null,null,null,null,null,null,null,null,null,null,null,null,null,null,null,null,null,null,null,null,null,null,null,null,null,null,null,null,null,null,null,null,"Mayen","272"]
[null,null,null,null,null,null,null,null,null,null,null,null,null,null,null,null,null,null,null,null,null,null,null,null,null,null,null,null,null,null,null,null,null,null,null,null,null,null,null,null,null,null,null,null,null,null,null,null,null,null,null,null,null,null,null,null,null,null,null,null,null,null,null,"Meissen","273"]
[null,null,null,null,null,null,null,null,null,null,null,null,null,null,null,null,null,null,null,null,null,null,null,null,null,null,null,null,null,null,null,null,null,null,null,null,null,null,null,null,null,null,null,null,null,null,null,null,null,null,null,null,null,null,null,null,null,null,null,null,null,null,null,"Mendrisio","274"]
[null,null,null,null,null,null,null,null,null,null,null,null,null,null,null,null,null,null,null,null,null,null,null,null,null,null,null,null,null,null,null,null,null,null,null,null,null,null,null,null,null,null,null,null,null,null,null,null,null,null,null,null,null,null,null,null,null,null,null,null,null,null,null,"Merseburg","275"]
[null,null,null,null,null,null,null,null,null,null,null,null,null,null,null,null,null,null,null,null,null,null,null,null,null,null,null,null,null,null,null,null,null,null,null,null,null,null,null,null,null,null,null,null,null,null,null,null,null,null,null,null,null,null,null,null,null,null,null,null,null,null,null,"Meschede","276"]
[null,null,null,null,null,null,null,null,null,null,null,null,null,null,null,null,null,null,null,null,null,null,null,null,null,null,null,null,null,null,null,null,null,null,null,null,null,null,null,null,null,null,null,null,null,null,null,null,null,null,null,null,null,null,null,null,null,null,null,null,null,null,null,"Milano","277"]
[null,null,null,null,null,null,null,null,null,null,null,null,null,null,null,null,null,null,null,null,null,null,null,null,null,null,null,null,null,null,null,null,null,null,null,null,null,null,null,null,null,null,null,null,null,null,null,null,null,null,null,null,null,null,null,null,null,null,null,null,null,null,null,"Minden","278"]
[null,null,null,null,null,null,null,null,null,null,null,null,null,null,null,null,null,null,null,null,null,null,null,null,null,null,null,null,null,null,null,null,null,null,null,null,null,null,null,null,null,null,null,null,null,null,null,null,null,null,null,null,null,null,null,null,null,null,null,null,null,null,null,"Mittweida","279"]
[null,null,null,null,null,null,null,null,null,null,null,null,null,null,null,null,null,null,null,null,null,null,null,null,null,null,null,null,null,null,null,null,null,null,null,null,null,null,null,null,null,null,null,null,null,null,null,null,null,null,null,null,null,null,null,null,null,null,null,null,null,null,null,"Modena","280"]
[null,null,null,null,null,null,null,null,null,null,null,null,null,null,null,null,null,null,null,null,null,null,null,null,null,null,null,null,null,null,null,null,null,null,null,null,null,null,null,null,null,null,null,null,null,null,null,null,null,null,null,null,null,null,null,null,null,null,null,null,null,null,null,"Mönchengladbach","281"]
[null,null,null,null,null,null,null,null,null,null,null,null,null,null,null,null,null,null,null,null,null,null,null,null,null,null,null,null,null,null,null,null,null,null,null,null,null,null,null,null,null,null,null,null,null,null,null,null,null,null,null,null,null,null,null,null,null,null,null,null,null,null,null,"Mosbach","282"]
[null,null,null,null,null,null,null,null,null,null,null,null,null,null,null,null,null,null,null,null,null,null,null,null,null,null,null,null,null,null,null,null,null,null,null,null,null,null,null,null,null,null,null,null,null,null,null,null,null,null,null,null,null,null,null,null,null,null,null,null,null,null,null,"Mülheim","283"]
[null,null,null,null,null,null,null,null,null,null,null,null,null,null,null,null,null,null,null,null,null,null,null,null,null,null,null,null,null,null,null,null,null,null,null,null,null,null,null,null,null,null,null,null,null,null,null,null,null,null,null,null,null,null,null,null,null,null,null,null,null,null,null,"Münchberg","284"]
[null,null,null,null,null,null,null,null,null,null,null,null,null,null,null,null,null,null,null,null,null,null,null,null,null,null,null,null,null,null,null,null,null,null,null,null,null,null,null,null,null,null,null,null,null,null,null,null,null,null,null,null,null,null,null,null,null,null,null,null,null,null,null,"München","285"]
[null,null,null,null,null,null,null,null,null,null,null,null,null,null,null,null,null,null,null,null,null,null,null,null,null,null,null,null,null,null,null,null,null,null,null,null,null,null,null,null,null,null,null,null,null,null,null,null,null,null,null,null,null,null,null,null,null,null,null,null,null,null,null,"Münster","286"]
[null,null,null,null,null,null,null,null,null,null,null,null,null,null,null,null,null,null,null,null,null,null,null,null,null,null,null,null,null,null,null,null,null,null,null,null,null,null,null,null,null,null,null,null,null,null,null,null,null,null,null,null,null,null,null,null,null,null,null,null,null,null,null,"Murcia","287"]
[null,null,null,null,null,null,null,null,null,null,null,null,null,null,null,null,null,null,null,null,null,null,null,null,null,null,null,null,null,null,null,null,null,null,null,null,null,null,null,null,null,null,null,null,null,null,null,null,null,null,null,null,null,null,null,null,null,null,null,null,null,null,null,"Navarra","288"]
[null,null,null,null,null,null,null,null,null,null,null,null,null,null,null,null,null,null,null,null,null,null,null,null,null,null,null,null,null,null,null,null,null,null,null,null,null,null,null,null,null,null,null,null,null,null,null,null,null,null,null,null,null,null,null,null,null,null,null,null,null,null,null,"Neubrandenburg","289"]
[null,null,null,null,null,null,null,null,null,null,null,null,null,null,null,null,null,null,null,null,null,null,null,null,null,null,null,null,null,null,null,null,null,null,null,null,null,null,null,null,null,null,null,null,null,null,null,null,null,null,null,null,null,null,null,null,null,null,null,null,null,null,null,"Neuenburg","290"]
[null,null,null,null,null,null,null,null,null,null,null,null,null,null,null,null,null,null,null,null,null,null,null,null,null,null,null,null,null,null,null,null,null,null,null,null,null,null,null,null,null,null,null,null,null,null,null,null,null,null,null,null,null,null,null,null,null,null,null,null,null,null,null,"Neuss","291"]
[null,null,null,null,null,null,null,null,null,null,null,null,null,null,null,null,null,null,null,null,null,null,null,null,null,null,null,null,null,null,null,null,null,null,null,null,null,null,null,null,null,null,null,null,null,null,null,null,null,null,null,null,null,null,null,null,null,null,null,null,null,null,null,"Neu-Ulm","292"]
[null,null,null,null,null,null,null,null,null,null,null,null,null,null,null,null,null,null,null,null,null,null,null,null,null,null,null,null,null,null,null,null,null,null,null,null,null,null,null,null,null,null,null,null,null,null,null,null,null,null,null,null,null,null,null,null,null,null,null,null,null,null,null,"Nienburg","293"]
[null,null,null,null,null,null,null,null,null,null,null,null,null,null,null,null,null,null,null,null,null,null,null,null,null,null,null,null,null,null,null,null,null,null,null,null,null,null,null,null,null,null,null,null,null,null,null,null,null,null,null,null,null,null,null,null,null,null,null,null,null,null,null,"Nijmengen","294"]
[null,null,null,null,null,null,null,null,null,null,null,null,null,null,null,null,null,null,null,null,null,null,null,null,null,null,null,null,null,null,null,null,null,null,null,null,null,null,null,null,null,null,null,null,null,null,null,null,null,null,null,null,null,null,null,null,null,null,null,null,null,null,null,"Nordhausen","295"]
[null,null,null,null,null,null,null,null,null,null,null,null,null,null,null,null,null,null,null,null,null,null,null,null,null,null,null,null,null,null,null,null,null,null,null,null,null,null,null,null,null,null,null,null,null,null,null,null,null,null,null,null,null,null,null,null,null,null,null,null,null,null,null,"Nordkirchen","296"]
[null,null,null,null,null,null,null,null,null,null,null,null,null,null,null,null,null,null,null,null,null,null,null,null,null,null,null,null,null,null,null,null,null,null,null,null,null,null,null,null,null,null,null,null,null,null,null,null,null,null,null,null,null,null,null,null,null,null,null,null,null,null,null,"Nottingham","297"]
[null,null,null,null,null,null,null,null,null,null,null,null,null,null,null,null,null,null,null,null,null,null,null,null,null,null,null,null,null,null,null,null,null,null,null,null,null,null,null,null,null,null,null,null,null,null,null,null,null,null,null,null,null,null,null,null,null,null,null,null,null,null,null,"Nürnberg","298"]
[null,null,null,null,null,null,null,null,null,null,null,null,null,null,null,null,null,null,null,null,null,null,null,null,null,null,null,null,null,null,null,null,null,null,null,null,null,null,null,null,null,null,null,null,null,null,null,null,null,null,null,null,null,null,null,null,null,null,null,null,null,null,null,"Nürtingen","299"]
[null,null,null,null,null,null,null,null,null,null,null,null,null,null,null,null,null,null,null,null,null,null,null,null,null,null,null,null,null,null,null,null,null,null,null,null,null,null,null,null,null,null,null,null,null,null,null,null,null,null,null,null,null,null,null,null,null,null,null,null,null,null,null,"Oberstein","300"]
[null,null,null,null,null,null,null,null,null,null,null,null,null,null,null,null,null,null,null,null,null,null,null,null,null,null,null,null,null,null,null,null,null,null,null,null,null,null,null,null,null,null,null,null,null,null,null,null,null,null,null,null,null,null,null,null,null,null,null,null,null,null,null,"Oberwallis","301"]
[null,null,null,null,null,null,null,null,null,null,null,null,null,null,null,null,null,null,null,null,null,null,null,null,null,null,null,null,null,null,null,null,null,null,null,null,null,null,null,null,null,null,null,null,null,null,null,null,null,null,null,null,null,null,null,null,null,null,null,null,null,null,null,"Oelsnitz","302"]
[null,null,null,null,null,null,null,null,null,null,null,null,null,null,null,null,null,null,null,null,null,null,null,null,null,null,null,null,null,null,null,null,null,null,null,null,null,null,null,null,null,null,null,null,null,null,null,null,null,null,null,null,null,null,null,null,null,null,null,null,null,null,null,"Oestrich","303"]
[null,null,null,null,null,null,null,null,null,null,null,null,null,null,null,null,null,null,null,null,null,null,null,null,null,null,null,null,null,null,null,null,null,null,null,null,null,null,null,null,null,null,null,null,null,null,null,null,null,null,null,null,null,null,null,null,null,null,null,null,null,null,null,"Offenbach","304"]
[null,null,null,null,null,null,null,null,null,null,null,null,null,null,null,null,null,null,null,null,null,null,null,null,null,null,null,null,null,null,null,null,null,null,null,null,null,null,null,null,null,null,null,null,null,null,null,null,null,null,null,null,null,null,null,null,null,null,null,null,null,null,null,"Offenburg","305"]
[null,null,null,null,null,null,null,null,null,null,null,null,null,null,null,null,null,null,null,null,null,null,null,null,null,null,null,null,null,null,null,null,null,null,null,null,null,null,null,null,null,null,null,null,null,null,null,null,null,null,null,null,null,null,null,null,null,null,null,null,null,null,null,"Oldenburg","306"]
[null,null,null,null,null,null,null,null,null,null,null,null,null,null,null,null,null,null,null,null,null,null,null,null,null,null,null,null,null,null,null,null,null,null,null,null,null,null,null,null,null,null,null,null,null,null,null,null,null,null,null,null,null,null,null,null,null,null,null,null,null,null,null,"Olten","307"]
[null,null,null,null,null,null,null,null,null,null,null,null,null,null,null,null,null,null,null,null,null,null,null,null,null,null,null,null,null,null,null,null,null,null,null,null,null,null,null,null,null,null,null,null,null,null,null,null,null,null,null,null,null,null,null,null,null,null,null,null,null,null,null,"Osnabrück","308"]
[null,null,null,null,null,null,null,null,null,null,null,null,null,null,null,null,null,null,null,null,null,null,null,null,null,null,null,null,null,null,null,null,null,null,null,null,null,null,null,null,null,null,null,null,null,null,null,null,null,null,null,null,null,null,null,null,null,null,null,null,null,null,null,"Oviedo","309"]
[null,null,null,null,null,null,null,null,null,null,null,null,null,null,null,null,null,null,null,null,null,null,null,null,null,null,null,null,null,null,null,null,null,null,null,null,null,null,null,null,null,null,null,null,null,null,null,null,null,null,null,null,null,null,null,null,null,null,null,null,null,null,null,"Oxford","310"]
[null,null,null,null,null,null,null,null,null,null,null,null,null,null,null,null,null,null,null,null,null,null,null,null,null,null,null,null,null,null,null,null,null,null,null,null,null,null,null,null,null,null,null,null,null,null,null,null,null,null,null,null,null,null,null,null,null,null,null,null,null,null,null,"Paderborn","311"]
[null,null,null,null,null,null,null,null,null,null,null,null,null,null,null,null,null,null,null,null,null,null,null,null,null,null,null,null,null,null,null,null,null,null,null,null,null,null,null,null,null,null,null,null,null,null,null,null,null,null,null,null,null,null,null,null,null,null,null,null,null,null,null,"Padova","312"]
[null,null,null,null,null,null,null,null,null,null,null,null,null,null,null,null,null,null,null,null,null,null,null,null,null,null,null,null,null,null,null,null,null,null,null,null,null,null,null,null,null,null,null,null,null,null,null,null,null,null,null,null,null,null,null,null,null,null,null,null,null,null,null,"Parma","313"]
[null,null,null,null,null,null,null,null,null,null,null,null,null,null,null,null,null,null,null,null,null,null,null,null,null,null,null,null,null,null,null,null,null,null,null,null,null,null,null,null,null,null,null,null,null,null,null,null,null,null,null,null,null,null,null,null,null,null,null,null,null,null,null,"Passau","314"]
[null,null,null,null,null,null,null,null,null,null,null,null,null,null,null,null,null,null,null,null,null,null,null,null,null,null,null,null,null,null,null,null,null,null,null,null,null,null,null,null,null,null,null,null,null,null,null,null,null,null,null,null,null,null,null,null,null,null,null,null,null,null,null,"Pavia","315"]
[null,null,null,null,null,null,null,null,null,null,null,null,null,null,null,null,null,null,null,null,null,null,null,null,null,null,null,null,null,null,null,null,null,null,null,null,null,null,null,null,null,null,null,null,null,null,null,null,null,null,null,null,null,null,null,null,null,null,null,null,null,null,null,"Perugia","316"]
[null,null,null,null,null,null,null,null,null,null,null,null,null,null,null,null,null,null,null,null,null,null,null,null,null,null,null,null,null,null,null,null,null,null,null,null,null,null,null,null,null,null,null,null,null,null,null,null,null,null,null,null,null,null,null,null,null,null,null,null,null,null,null,"Pforzheim","317"]
[null,null,null,null,null,null,null,null,null,null,null,null,null,null,null,null,null,null,null,null,null,null,null,null,null,null,null,null,null,null,null,null,null,null,null,null,null,null,null,null,null,null,null,null,null,null,null,null,null,null,null,null,null,null,null,null,null,null,null,null,null,null,null,"Pinkafeld","318"]
[null,null,null,null,null,null,null,null,null,null,null,null,null,null,null,null,null,null,null,null,null,null,null,null,null,null,null,null,null,null,null,null,null,null,null,null,null,null,null,null,null,null,null,null,null,null,null,null,null,null,null,null,null,null,null,null,null,null,null,null,null,null,null,"Pinneberg","319"]
[null,null,null,null,null,null,null,null,null,null,null,null,null,null,null,null,null,null,null,null,null,null,null,null,null,null,null,null,null,null,null,null,null,null,null,null,null,null,null,null,null,null,null,null,null,null,null,null,null,null,null,null,null,null,null,null,null,null,null,null,null,null,null,"Pirmasens","320"]
[null,null,null,null,null,null,null,null,null,null,null,null,null,null,null,null,null,null,null,null,null,null,null,null,null,null,null,null,null,null,null,null,null,null,null,null,null,null,null,null,null,null,null,null,null,null,null,null,null,null,null,null,null,null,null,null,null,null,null,null,null,null,null,"Pisa","321"]
[null,null,null,null,null,null,null,null,null,null,null,null,null,null,null,null,null,null,null,null,null,null,null,null,null,null,null,null,null,null,null,null,null,null,null,null,null,null,null,null,null,null,null,null,null,null,null,null,null,null,null,null,null,null,null,null,null,null,null,null,null,null,null,"Potsdam","322"]
[null,null,null,null,null,null,null,null,null,null,null,null,null,null,null,null,null,null,null,null,null,null,null,null,null,null,null,null,null,null,null,null,null,null,null,null,null,null,null,null,null,null,null,null,null,null,null,null,null,null,null,null,null,null,null,null,null,null,null,null,null,null,null,"Rapperswil","323"]
[null,null,null,null,null,null,null,null,null,null,null,null,null,null,null,null,null,null,null,null,null,null,null,null,null,null,null,null,null,null,null,null,null,null,null,null,null,null,null,null,null,null,null,null,null,null,null,null,null,null,null,null,null,null,null,null,null,null,null,null,null,null,null,"Ravensburg","324"]
[null,null,null,null,null,null,null,null,null,null,null,null,null,null,null,null,null,null,null,null,null,null,null,null,null,null,null,null,null,null,null,null,null,null,null,null,null,null,null,null,null,null,null,null,null,null,null,null,null,null,null,null,null,null,null,null,null,null,null,null,null,null,null,"Recklinghausen","325"]
[null,null,null,null,null,null,null,null,null,null,null,null,null,null,null,null,null,null,null,null,null,null,null,null,null,null,null,null,null,null,null,null,null,null,null,null,null,null,null,null,null,null,null,null,null,null,null,null,null,null,null,null,null,null,null,null,null,null,null,null,null,null,null,"Regensburg","326"]
[null,null,null,null,null,null,null,null,null,null,null,null,null,null,null,null,null,null,null,null,null,null,null,null,null,null,null,null,null,null,null,null,null,null,null,null,null,null,null,null,null,null,null,null,null,null,null,null,null,null,null,null,null,null,null,null,null,null,null,null,null,null,null,"Remagen","327"]
[null,null,null,null,null,null,null,null,null,null,null,null,null,null,null,null,null,null,null,null,null,null,null,null,null,null,null,null,null,null,null,null,null,null,null,null,null,null,null,null,null,null,null,null,null,null,null,null,null,null,null,null,null,null,null,null,null,null,null,null,null,null,null,"Rendsburg","328"]
[null,null,null,null,null,null,null,null,null,null,null,null,null,null,null,null,null,null,null,null,null,null,null,null,null,null,null,null,null,null,null,null,null,null,null,null,null,null,null,null,null,null,null,null,null,null,null,null,null,null,null,null,null,null,null,null,null,null,null,null,null,null,null,"Reutlingen","329"]
[null,null,null,null,null,null,null,null,null,null,null,null,null,null,null,null,null,null,null,null,null,null,null,null,null,null,null,null,null,null,null,null,null,null,null,null,null,null,null,null,null,null,null,null,null,null,null,null,null,null,null,null,null,null,null,null,null,null,null,null,null,null,null,"Rheinbach","330"]
[null,null,null,null,null,null,null,null,null,null,null,null,null,null,null,null,null,null,null,null,null,null,null,null,null,null,null,null,null,null,null,null,null,null,null,null,null,null,null,null,null,null,null,null,null,null,null,null,null,null,null,null,null,null,null,null,null,null,null,null,null,null,null,"Riesa","331"]
[null,null,null,null,null,null,null,null,null,null,null,null,null,null,null,null,null,null,null,null,null,null,null,null,null,null,null,null,null,null,null,null,null,null,null,null,null,null,null,null,null,null,null,null,null,null,null,null,null,null,null,null,null,null,null,null,null,null,null,null,null,null,null,"Rödermark","332"]
[null,null,null,null,null,null,null,null,null,null,null,null,null,null,null,null,null,null,null,null,null,null,null,null,null,null,null,null,null,null,null,null,null,null,null,null,null,null,null,null,null,null,null,null,null,null,null,null,null,null,null,null,null,null,null,null,null,null,null,null,null,null,null,"Rom","333"]
[null,null,null,null,null,null,null,null,null,null,null,null,null,null,null,null,null,null,null,null,null,null,null,null,null,null,null,null,null,null,null,null,null,null,null,null,null,null,null,null,null,null,null,null,null,null,null,null,null,null,null,null,null,null,null,null,null,null,null,null,null,null,null,"Rosenheim","334"]
[null,null,null,null,null,null,null,null,null,null,null,null,null,null,null,null,null,null,null,null,null,null,null,null,null,null,null,null,null,null,null,null,null,null,null,null,null,null,null,null,null,null,null,null,null,null,null,null,null,null,null,null,null,null,null,null,null,null,null,null,null,null,null,"Rostock","335"]
[null,null,null,null,null,null,null,null,null,null,null,null,null,null,null,null,null,null,null,null,null,null,null,null,null,null,null,null,null,null,null,null,null,null,null,null,null,null,null,null,null,null,null,null,null,null,null,null,null,null,null,null,null,null,null,null,null,null,null,null,null,null,null,"Rottenburg","336"]
[null,null,null,null,null,null,null,null,null,null,null,null,null,null,null,null,null,null,null,null,null,null,null,null,null,null,null,null,null,null,null,null,null,null,null,null,null,null,null,null,null,null,null,null,null,null,null,null,null,null,null,null,null,null,null,null,null,null,null,null,null,null,null,"Rotterdam","337"]
[null,null,null,null,null,null,null,null,null,null,null,null,null,null,null,null,null,null,null,null,null,null,null,null,null,null,null,null,null,null,null,null,null,null,null,null,null,null,null,null,null,null,null,null,null,null,null,null,null,null,null,null,null,null,null,null,null,null,null,null,null,null,null,"Rüsselsheim","338"]
[null,null,null,null,null,null,null,null,null,null,null,null,null,null,null,null,null,null,null,null,null,null,null,null,null,null,null,null,null,null,null,null,null,null,null,null,null,null,null,null,null,null,null,null,null,null,null,null,null,null,null,null,null,null,null,null,null,null,null,null,null,null,null,"Saarbrücken","339"]
[null,null,null,null,null,null,null,null,null,null,null,null,null,null,null,null,null,null,null,null,null,null,null,null,null,null,null,null,null,null,null,null,null,null,null,null,null,null,null,null,null,null,null,null,null,null,null,null,null,null,null,null,null,null,null,null,null,null,null,null,null,null,null,"Salamanca","340"]
[null,null,null,null,null,null,null,null,null,null,null,null,null,null,null,null,null,null,null,null,null,null,null,null,null,null,null,null,null,null,null,null,null,null,null,null,null,null,null,null,null,null,null,null,null,null,null,null,null,null,null,null,null,null,null,null,null,null,null,null,null,null,null,"Salzburg","341"]
[null,null,null,null,null,null,null,null,null,null,null,null,null,null,null,null,null,null,null,null,null,null,null,null,null,null,null,null,null,null,null,null,null,null,null,null,null,null,null,null,null,null,null,null,null,null,null,null,null,null,null,null,null,null,null,null,null,null,null,null,null,null,null,"Salzgitter","342"]
[null,null,null,null,null,null,null,null,null,null,null,null,null,null,null,null,null,null,null,null,null,null,null,null,null,null,null,null,null,null,null,null,null,null,null,null,null,null,null,null,null,null,null,null,null,null,null,null,null,null,null,null,null,null,null,null,null,null,null,null,null,null,null,"Sankt Augustin","343"]
[null,null,null,null,null,null,null,null,null,null,null,null,null,null,null,null,null,null,null,null,null,null,null,null,null,null,null,null,null,null,null,null,null,null,null,null,null,null,null,null,null,null,null,null,null,null,null,null,null,null,null,null,null,null,null,null,null,null,null,null,null,null,null,"Santiago","344"]
[null,null,null,null,null,null,null,null,null,null,null,null,null,null,null,null,null,null,null,null,null,null,null,null,null,null,null,null,null,null,null,null,null,null,null,null,null,null,null,null,null,null,null,null,null,null,null,null,null,null,null,null,null,null,null,null,null,null,null,null,null,null,null,"Schmalkalden","345"]
[null,null,null,null,null,null,null,null,null,null,null,null,null,null,null,null,null,null,null,null,null,null,null,null,null,null,null,null,null,null,null,null,null,null,null,null,null,null,null,null,null,null,null,null,null,null,null,null,null,null,null,null,null,null,null,null,null,null,null,null,null,null,null,"Schönau","346"]
[null,null,null,null,null,null,null,null,null,null,null,null,null,null,null,null,null,null,null,null,null,null,null,null,null,null,null,null,null,null,null,null,null,null,null,null,null,null,null,null,null,null,null,null,null,null,null,null,null,null,null,null,null,null,null,null,null,null,null,null,null,null,null,"Schwäbisch Gmünd","347"]
[null,null,null,null,null,null,null,null,null,null,null,null,null,null,null,null,null,null,null,null,null,null,null,null,null,null,null,null,null,null,null,null,null,null,null,null,null,null,null,null,null,null,null,null,null,null,null,null,null,null,null,null,null,null,null,null,null,null,null,null,null,null,null,"Schwäbisch Hall","348"]
[null,null,null,null,null,null,null,null,null,null,null,null,null,null,null,null,null,null,null,null,null,null,null,null,null,null,null,null,null,null,null,null,null,null,null,null,null,null,null,null,null,null,null,null,null,null,null,null,null,null,null,null,null,null,null,null,null,null,null,null,null,null,null,"Schweinfurt","349"]
[null,null,null,null,null,null,null,null,null,null,null,null,null,null,null,null,null,null,null,null,null,null,null,null,null,null,null,null,null,null,null,null,null,null,null,null,null,null,null,null,null,null,null,null,null,null,null,null,null,null,null,null,null,null,null,null,null,null,null,null,null,null,null,"Senftenberg","350"]
[null,null,null,null,null,null,null,null,null,null,null,null,null,null,null,null,null,null,null,null,null,null,null,null,null,null,null,null,null,null,null,null,null,null,null,null,null,null,null,null,null,null,null,null,null,null,null,null,null,null,null,null,null,null,null,null,null,null,null,null,null,null,null,"Sevilla","351"]
[null,null,null,null,null,null,null,null,null,null,null,null,null,null,null,null,null,null,null,null,null,null,null,null,null,null,null,null,null,null,null,null,null,null,null,null,null,null,null,null,null,null,null,null,null,null,null,null,null,null,null,null,null,null,null,null,null,null,null,null,null,null,null,"Sheffield","352"]
[null,null,null,null,null,null,null,null,null,null,null,null,null,null,null,null,null,null,null,null,null,null,null,null,null,null,null,null,null,null,null,null,null,null,null,null,null,null,null,null,null,null,null,null,null,null,null,null,null,null,null,null,null,null,null,null,null,null,null,null,null,null,null,"Siegen","353"]
[null,null,null,null,null,null,null,null,null,null,null,null,null,null,null,null,null,null,null,null,null,null,null,null,null,null,null,null,null,null,null,null,null,null,null,null,null,null,null,null,null,null,null,null,null,null,null,null,null,null,null,null,null,null,null,null,null,null,null,null,null,null,null,"Siena","354"]
[null,null,null,null,null,null,null,null,null,null,null,null,null,null,null,null,null,null,null,null,null,null,null,null,null,null,null,null,null,null,null,null,null,null,null,null,null,null,null,null,null,null,null,null,null,null,null,null,null,null,null,null,null,null,null,null,null,null,null,null,null,null,null,"Sigmaringen","355"]
[null,null,null,null,null,null,null,null,null,null,null,null,null,null,null,null,null,null,null,null,null,null,null,null,null,null,null,null,null,null,null,null,null,null,null,null,null,null,null,null,null,null,null,null,null,null,null,null,null,null,null,null,null,null,null,null,null,null,null,null,null,null,null,"Sion","356"]
[null,null,null,null,null,null,null,null,null,null,null,null,null,null,null,null,null,null,null,null,null,null,null,null,null,null,null,null,null,null,null,null,null,null,null,null,null,null,null,null,null,null,null,null,null,null,null,null,null,null,null,null,null,null,null,null,null,null,null,null,null,null,null,"Soest","357"]
[null,null,null,null,null,null,null,null,null,null,null,null,null,null,null,null,null,null,null,null,null,null,null,null,null,null,null,null,null,null,null,null,null,null,null,null,null,null,null,null,null,null,null,null,null,null,null,null,null,null,null,null,null,null,null,null,null,null,null,null,null,null,null,"Spittal","358"]
[null,null,null,null,null,null,null,null,null,null,null,null,null,null,null,null,null,null,null,null,null,null,null,null,null,null,null,null,null,null,null,null,null,null,null,null,null,null,null,null,null,null,null,null,null,null,null,null,null,null,null,null,null,null,null,null,null,null,null,null,null,null,null,"St. Gallen","359"]
[null,null,null,null,null,null,null,null,null,null,null,null,null,null,null,null,null,null,null,null,null,null,null,null,null,null,null,null,null,null,null,null,null,null,null,null,null,null,null,null,null,null,null,null,null,null,null,null,null,null,null,null,null,null,null,null,null,null,null,null,null,null,null,"St. Pölten","360"]
[null,null,null,null,null,null,null,null,null,null,null,null,null,null,null,null,null,null,null,null,null,null,null,null,null,null,null,null,null,null,null,null,null,null,null,null,null,null,null,null,null,null,null,null,null,null,null,null,null,null,null,null,null,null,null,null,null,null,null,null,null,null,null,"Steinfurt","361"]
[null,null,null,null,null,null,null,null,null,null,null,null,null,null,null,null,null,null,null,null,null,null,null,null,null,null,null,null,null,null,null,null,null,null,null,null,null,null,null,null,null,null,null,null,null,null,null,null,null,null,null,null,null,null,null,null,null,null,null,null,null,null,null,"Stendal","362"]
[null,null,null,null,null,null,null,null,null,null,null,null,null,null,null,null,null,null,null,null,null,null,null,null,null,null,null,null,null,null,null,null,null,null,null,null,null,null,null,null,null,null,null,null,null,null,null,null,null,null,null,null,null,null,null,null,null,null,null,null,null,null,null,"Steyr","363"]
[null,null,null,null,null,null,null,null,null,null,null,null,null,null,null,null,null,null,null,null,null,null,null,null,null,null,null,null,null,null,null,null,null,null,null,null,null,null,null,null,null,null,null,null,null,null,null,null,null,null,null,null,null,null,null,null,null,null,null,null,null,null,null,"Stirling","364"]
[null,null,null,null,null,null,null,null,null,null,null,null,null,null,null,null,null,null,null,null,null,null,null,null,null,null,null,null,null,null,null,null,null,null,null,null,null,null,null,null,null,null,null,null,null,null,null,null,null,null,null,null,null,null,null,null,null,null,null,null,null,null,null,"Stralsund","365"]
[null,null,null,null,null,null,null,null,null,null,null,null,null,null,null,null,null,null,null,null,null,null,null,null,null,null,null,null,null,null,null,null,null,null,null,null,null,null,null,null,null,null,null,null,null,null,null,null,null,null,null,null,null,null,null,null,null,null,null,null,null,null,null,"Stuttgart","366"]
[null,null,null,null,null,null,null,null,null,null,null,null,null,null,null,null,null,null,null,null,null,null,null,null,null,null,null,null,null,null,null,null,null,null,null,null,null,null,null,null,null,null,null,null,null,null,null,null,null,null,null,null,null,null,null,null,null,null,null,null,null,null,null,"Suderburg","367"]
[null,null,null,null,null,null,null,null,null,null,null,null,null,null,null,null,null,null,null,null,null,null,null,null,null,null,null,null,null,null,null,null,null,null,null,null,null,null,null,null,null,null,null,null,null,null,null,null,null,null,null,null,null,null,null,null,null,null,null,null,null,null,null,"Surrey","368"]
[null,null,null,null,null,null,null,null,null,null,null,null,null,null,null,null,null,null,null,null,null,null,null,null,null,null,null,null,null,null,null,null,null,null,null,null,null,null,null,null,null,null,null,null,null,null,null,null,null,null,null,null,null,null,null,null,null,null,null,null,null,null,null,"Sussex","369"]
[null,null,null,null,null,null,null,null,null,null,null,null,null,null,null,null,null,null,null,null,null,null,null,null,null,null,null,null,null,null,null,null,null,null,null,null,null,null,null,null,null,null,null,null,null,null,null,null,null,null,null,null,null,null,null,null,null,null,null,null,null,null,null,"Trier","370"]
[null,null,null,null,null,null,null,null,null,null,null,null,null,null,null,null,null,null,null,null,null,null,null,null,null,null,null,null,null,null,null,null,null,null,null,null,null,null,null,null,null,null,null,null,null,null,null,null,null,null,null,null,null,null,null,null,null,null,null,null,null,null,null,"Triesdorf","371"]
[null,null,null,null,null,null,null,null,null,null,null,null,null,null,null,null,null,null,null,null,null,null,null,null,null,null,null,null,null,null,null,null,null,null,null,null,null,null,null,null,null,null,null,null,null,null,null,null,null,null,null,null,null,null,null,null,null,null,null,null,null,null,null,"Trieste","372"]
[null,null,null,null,null,null,null,null,null,null,null,null,null,null,null,null,null,null,null,null,null,null,null,null,null,null,null,null,null,null,null,null,null,null,null,null,null,null,null,null,null,null,null,null,null,null,null,null,null,null,null,null,null,null,null,null,null,null,null,null,null,null,null,"Tübingen","373"]
[null,null,null,null,null,null,null,null,null,null,null,null,null,null,null,null,null,null,null,null,null,null,null,null,null,null,null,null,null,null,null,null,null,null,null,null,null,null,null,null,null,null,null,null,null,null,null,null,null,null,null,null,null,null,null,null,null,null,null,null,null,null,null,"Twente","374"]
[null,null,null,null,null,null,null,null,null,null,null,null,null,null,null,null,null,null,null,null,null,null,null,null,null,null,null,null,null,null,null,null,null,null,null,null,null,null,null,null,null,null,null,null,null,null,null,null,null,null,null,null,null,null,null,null,null,null,null,null,null,null,null,"Udine","375"]
[null,null,null,null,null,null,null,null,null,null,null,null,null,null,null,null,null,null,null,null,null,null,null,null,null,null,null,null,null,null,null,null,null,null,null,null,null,null,null,null,null,null,null,null,null,null,null,null,null,null,null,null,null,null,null,null,null,null,null,null,null,null,null,"Ulm","376"]
[null,null,null,null,null,null,null,null,null,null,null,null,null,null,null,null,null,null,null,null,null,null,null,null,null,null,null,null,null,null,null,null,null,null,null,null,null,null,null,null,null,null,null,null,null,null,null,null,null,null,null,null,null,null,null,null,null,null,null,null,null,null,null,"Urbino","377"]
[null,null,null,null,null,null,null,null,null,null,null,null,null,null,null,null,null,null,null,null,null,null,null,null,null,null,null,null,null,null,null,null,null,null,null,null,null,null,null,null,null,null,null,null,null,null,null,null,null,null,null,null,null,null,null,null,null,null,null,null,null,null,null,"Usedom","378"]
[null,null,null,null,null,null,null,null,null,null,null,null,null,null,null,null,null,null,null,null,null,null,null,null,null,null,null,null,null,null,null,null,null,null,null,null,null,null,null,null,null,null,null,null,null,null,null,null,null,null,null,null,null,null,null,null,null,null,null,null,null,null,null,"Utrecht","379"]
[null,null,null,null,null,null,null,null,null,null,null,null,null,null,null,null,null,null,null,null,null,null,null,null,null,null,null,null,null,null,null,null,null,null,null,null,null,null,null,null,null,null,null,null,null,null,null,null,null,null,null,null,null,null,null,null,null,null,null,null,null,null,null,"Valencia","380"]
[null,null,null,null,null,null,null,null,null,null,null,null,null,null,null,null,null,null,null,null,null,null,null,null,null,null,null,null,null,null,null,null,null,null,null,null,null,null,null,null,null,null,null,null,null,null,null,null,null,null,null,null,null,null,null,null,null,null,null,null,null,null,null,"Valladolid","381"]
[null,null,null,null,null,null,null,null,null,null,null,null,null,null,null,null,null,null,null,null,null,null,null,null,null,null,null,null,null,null,null,null,null,null,null,null,null,null,null,null,null,null,null,null,null,null,null,null,null,null,null,null,null,null,null,null,null,null,null,null,null,null,null,"Vallendar","382"]
[null,null,null,null,null,null,null,null,null,null,null,null,null,null,null,null,null,null,null,null,null,null,null,null,null,null,null,null,null,null,null,null,null,null,null,null,null,null,null,null,null,null,null,null,null,null,null,null,null,null,null,null,null,null,null,null,null,null,null,null,null,null,null,"Vechta","383"]
[null,null,null,null,null,null,null,null,null,null,null,null,null,null,null,null,null,null,null,null,null,null,null,null,null,null,null,null,null,null,null,null,null,null,null,null,null,null,null,null,null,null,null,null,null,null,null,null,null,null,null,null,null,null,null,null,null,null,null,null,null,null,null,"Venezia","384"]
[null,null,null,null,null,null,null,null,null,null,null,null,null,null,null,null,null,null,null,null,null,null,null,null,null,null,null,null,null,null,null,null,null,null,null,null,null,null,null,null,null,null,null,null,null,null,null,null,null,null,null,null,null,null,null,null,null,null,null,null,null,null,null,"Venlo","385"]
[null,null,null,null,null,null,null,null,null,null,null,null,null,null,null,null,null,null,null,null,null,null,null,null,null,null,null,null,null,null,null,null,null,null,null,null,null,null,null,null,null,null,null,null,null,null,null,null,null,null,null,null,null,null,null,null,null,null,null,null,null,null,null,"Verona","386"]
[null,null,null,null,null,null,null,null,null,null,null,null,null,null,null,null,null,null,null,null,null,null,null,null,null,null,null,null,null,null,null,null,null,null,null,null,null,null,null,null,null,null,null,null,null,null,null,null,null,null,null,null,null,null,null,null,null,null,null,null,null,null,null,"Villach","387"]
[null,null,null,null,null,null,null,null,null,null,null,null,null,null,null,null,null,null,null,null,null,null,null,null,null,null,null,null,null,null,null,null,null,null,null,null,null,null,null,null,null,null,null,null,null,null,null,null,null,null,null,null,null,null,null,null,null,null,null,null,null,null,null,"Villingen-Schwenningen","388"]
[null,null,null,null,null,null,null,null,null,null,null,null,null,null,null,null,null,null,null,null,null,null,null,null,null,null,null,null,null,null,null,null,null,null,null,null,null,null,null,null,null,null,null,null,null,null,null,null,null,null,null,null,null,null,null,null,null,null,null,null,null,null,null,"WädenswilI","389"]
[null,null,null,null,null,null,null,null,null,null,null,null,null,null,null,null,null,null,null,null,null,null,null,null,null,null,null,null,null,null,null,null,null,null,null,null,null,null,null,null,null,null,null,null,null,null,null,null,null,null,null,null,null,null,null,null,null,null,null,null,null,null,null,"Wageningen","390"]
[null,null,null,null,null,null,null,null,null,null,null,null,null,null,null,null,null,null,null,null,null,null,null,null,null,null,null,null,null,null,null,null,null,null,null,null,null,null,null,null,null,null,null,null,null,null,null,null,null,null,null,null,null,null,null,null,null,null,null,null,null,null,null,"Waldeck","391"]
[null,null,null,null,null,null,null,null,null,null,null,null,null,null,null,null,null,null,null,null,null,null,null,null,null,null,null,null,null,null,null,null,null,null,null,null,null,null,null,null,null,null,null,null,null,null,null,null,null,null,null,null,null,null,null,null,null,null,null,null,null,null,null,"Wales","392"]
[null,null,null,null,null,null,null,null,null,null,null,null,null,null,null,null,null,null,null,null,null,null,null,null,null,null,null,null,null,null,null,null,null,null,null,null,null,null,null,null,null,null,null,null,null,null,null,null,null,null,null,null,null,null,null,null,null,null,null,null,null,null,null,"Warnemünde","393"]
[null,null,null,null,null,null,null,null,null,null,null,null,null,null,null,null,null,null,null,null,null,null,null,null,null,null,null,null,null,null,null,null,null,null,null,null,null,null,null,null,null,null,null,null,null,null,null,null,null,null,null,null,null,null,null,null,null,null,null,null,null,null,null,"Warwick","394"]
[null,null,null,null,null,null,null,null,null,null,null,null,null,null,null,null,null,null,null,null,null,null,null,null,null,null,null,null,null,null,null,null,null,null,null,null,null,null,null,null,null,null,null,null,null,null,null,null,null,null,null,null,null,null,null,null,null,null,null,null,null,null,null,"Wedel","395"]
[null,null,null,null,null,null,null,null,null,null,null,null,null,null,null,null,null,null,null,null,null,null,null,null,null,null,null,null,null,null,null,null,null,null,null,null,null,null,null,null,null,null,null,null,null,null,null,null,null,null,null,null,null,null,null,null,null,null,null,null,null,null,null,"Weiden","396"]
[null,null,null,null,null,null,null,null,null,null,null,null,null,null,null,null,null,null,null,null,null,null,null,null,null,null,null,null,null,null,null,null,null,null,null,null,null,null,null,null,null,null,null,null,null,null,null,null,null,null,null,null,null,null,null,null,null,null,null,null,null,null,null,"Weihenstephan","397"]
[null,null,null,null,null,null,null,null,null,null,null,null,null,null,null,null,null,null,null,null,null,null,null,null,null,null,null,null,null,null,null,null,null,null,null,null,null,null,null,null,null,null,null,null,null,null,null,null,null,null,null,null,null,null,null,null,null,null,null,null,null,null,null,"Weimar","398"]
[null,null,null,null,null,null,null,null,null,null,null,null,null,null,null,null,null,null,null,null,null,null,null,null,null,null,null,null,null,null,null,null,null,null,null,null,null,null,null,null,null,null,null,null,null,null,null,null,null,null,null,null,null,null,null,null,null,null,null,null,null,null,null,"Weingarten","399"]
[null,null,null,null,null,null,null,null,null,null,null,null,null,null,null,null,null,null,null,null,null,null,null,null,null,null,null,null,null,null,null,null,null,null,null,null,null,null,null,null,null,null,null,null,null,null,null,null,null,null,null,null,null,null,null,null,null,null,null,null,null,null,null,"Wels","400"]
[null,null,null,null,null,null,null,null,null,null,null,null,null,null,null,null,null,null,null,null,null,null,null,null,null,null,null,null,null,null,null,null,null,null,null,null,null,null,null,null,null,null,null,null,null,null,null,null,null,null,null,null,null,null,null,null,null,null,null,null,null,null,null,"Wern","401"]
[null,null,null,null,null,null,null,null,null,null,null,null,null,null,null,null,null,null,null,null,null,null,null,null,null,null,null,null,null,null,null,null,null,null,null,null,null,null,null,null,null,null,null,null,null,null,null,null,null,null,null,null,null,null,null,null,null,null,null,null,null,null,null,"Wernigerode","402"]
[null,null,null,null,null,null,null,null,null,null,null,null,null,null,null,null,null,null,null,null,null,null,null,null,null,null,null,null,null,null,null,null,null,null,null,null,null,null,null,null,null,null,null,null,null,null,null,null,null,null,null,null,null,null,null,null,null,null,null,null,null,null,null,"Westminster","403"]
[null,null,null,null,null,null,null,null,null,null,null,null,null,null,null,null,null,null,null,null,null,null,null,null,null,null,null,null,null,null,null,null,null,null,null,null,null,null,null,null,null,null,null,null,null,null,null,null,null,null,null,null,null,null,null,null,null,null,null,null,null,null,null,"Wien","404"]
[null,null,null,null,null,null,null,null,null,null,null,null,null,null,null,null,null,null,null,null,null,null,null,null,null,null,null,null,null,null,null,null,null,null,null,null,null,null,null,null,null,null,null,null,null,null,null,null,null,null,null,null,null,null,null,null,null,null,null,null,null,null,null,"Wiesbaden","405"]
[null,null,null,null,null,null,null,null,null,null,null,null,null,null,null,null,null,null,null,null,null,null,null,null,null,null,null,null,null,null,null,null,null,null,null,null,null,null,null,null,null,null,null,null,null,null,null,null,null,null,null,null,null,null,null,null,null,null,null,null,null,null,null,"Wildau","406"]
[null,null,null,null,null,null,null,null,null,null,null,null,null,null,null,null,null,null,null,null,null,null,null,null,null,null,null,null,null,null,null,null,null,null,null,null,null,null,null,null,null,null,null,null,null,null,null,null,null,null,null,null,null,null,null,null,null,null,null,null,null,null,null,"Wilhelmshaven","407"]
[null,null,null,null,null,null,null,null,null,null,null,null,null,null,null,null,null,null,null,null,null,null,null,null,null,null,null,null,null,null,null,null,null,null,null,null,null,null,null,null,null,null,null,null,null,null,null,null,null,null,null,null,null,null,null,null,null,null,null,null,null,null,null,"Windisch","408"]
[null,null,null,null,null,null,null,null,null,null,null,null,null,null,null,null,null,null,null,null,null,null,null,null,null,null,null,null,null,null,null,null,null,null,null,null,null,null,null,null,null,null,null,null,null,null,null,null,null,null,null,null,null,null,null,null,null,null,null,null,null,null,null,"Winkel","409"]
[null,null,null,null,null,null,null,null,null,null,null,null,null,null,null,null,null,null,null,null,null,null,null,null,null,null,null,null,null,null,null,null,null,null,null,null,null,null,null,null,null,null,null,null,null,null,null,null,null,null,null,null,null,null,null,null,null,null,null,null,null,null,null,"Winkel","410"]
[null,null,null,null,null,null,null,null,null,null,null,null,null,null,null,null,null,null,null,null,null,null,null,null,null,null,null,null,null,null,null,null,null,null,null,null,null,null,null,null,null,null,null,null,null,null,null,null,null,null,null,null,null,null,null,null,null,null,null,null,null,null,null,"Winterthur","411"]
[null,null,null,null,null,null,null,null,null,null,null,null,null,null,null,null,null,null,null,null,null,null,null,null,null,null,null,null,null,null,null,null,null,null,null,null,null,null,null,null,null,null,null,null,null,null,null,null,null,null,null,null,null,null,null,null,null,null,null,null,null,null,null,"Wismar","412"]
[null,null,null,null,null,null,null,null,null,null,null,null,null,null,null,null,null,null,null,null,null,null,null,null,null,null,null,null,null,null,null,null,null,null,null,null,null,null,null,null,null,null,null,null,null,null,null,null,null,null,null,null,null,null,null,null,null,null,null,null,null,null,null,"Witten","413"]
[null,null,null,null,null,null,null,null,null,null,null,null,null,null,null,null,null,null,null,null,null,null,null,null,null,null,null,null,null,null,null,null,null,null,null,null,null,null,null,null,null,null,null,null,null,null,null,null,null,null,null,null,null,null,null,null,null,null,null,null,null,null,null,"Wittenberg","414"]
[null,null,null,null,null,null,null,null,null,null,null,null,null,null,null,null,null,null,null,null,null,null,null,null,null,null,null,null,null,null,null,null,null,null,null,null,null,null,null,null,null,null,null,null,null,null,null,null,null,null,null,null,null,null,null,null,null,null,null,null,null,null,null,"Wittich","415"]
[null,null,null,null,null,null,null,null,null,null,null,null,null,null,null,null,null,null,null,null,null,null,null,null,null,null,null,null,null,null,null,null,null,null,null,null,null,null,null,null,null,null,null,null,null,null,null,null,null,null,null,null,null,null,null,null,null,null,null,null,null,null,null,"Wolfenbüttel","416"]
[null,null,null,null,null,null,null,null,null,null,null,null,null,null,null,null,null,null,null,null,null,null,null,null,null,null,null,null,null,null,null,null,null,null,null,null,null,null,null,null,null,null,null,null,null,null,null,null,null,null,null,null,null,null,null,null,null,null,null,null,null,null,null,"Worms","417"]
[null,null,null,null,null,null,null,null,null,null,null,null,null,null,null,null,null,null,null,null,null,null,null,null,null,null,null,null,null,null,null,null,null,null,null,null,null,null,null,null,null,null,null,null,null,null,null,null,null,null,null,null,null,null,null,null,null,null,null,null,null,null,null,"Wünnen","418"]
[null,null,null,null,null,null,null,null,null,null,null,null,null,null,null,null,null,null,null,null,null,null,null,null,null,null,null,null,null,null,null,null,null,null,null,null,null,null,null,null,null,null,null,null,null,null,null,null,null,null,null,null,null,null,null,null,null,null,null,null,null,null,null,"Wuppertal","419"]
[null,null,null,null,null,null,null,null,null,null,null,null,null,null,null,null,null,null,null,null,null,null,null,null,null,null,null,null,null,null,null,null,null,null,null,null,null,null,null,null,null,null,null,null,null,null,null,null,null,null,null,null,null,null,null,null,null,null,null,null,null,null,null,"Würzburg","420"]
[null,null,null,null,null,null,null,null,null,null,null,null,null,null,null,null,null,null,null,null,null,null,null,null,null,null,null,null,null,null,null,null,null,null,null,null,null,null,null,null,null,null,null,null,null,null,null,null,null,null,null,null,null,null,null,null,null,null,null,null,null,null,null,"Yverdon-les-Bains","421"]
[null,null,null,null,null,null,null,null,null,null,null,null,null,null,null,null,null,null,null,null,null,null,null,null,null,null,null,null,null,null,null,null,null,null,null,null,null,null,null,null,null,null,null,null,null,null,null,null,null,null,null,null,null,null,null,null,null,null,null,null,null,null,null,"Zaragoza","422"]
[null,null,null,null,null,null,null,null,null,null,null,null,null,null,null,null,null,null,null,null,null,null,null,null,null,null,null,null,null,null,null,null,null,null,null,null,null,null,null,null,null,null,null,null,null,null,null,null,null,null,null,null,null,null,null,null,null,null,null,null,null,null,null,"Zollikofen","423"]
[null,null,null,null,null,null,null,null,null,null,null,null,null,null,null,null,null,null,null,null,null,null,null,null,null,null,null,null,null,null,null,null,null,null,null,null,null,null,null,null,null,null,null,null,null,null,null,null,null,null,null,null,null,null,null,null,null,null,null,null,null,null,null,"Zürich","424"]
[null,null,null,null,null,null,null,null,null,null,null,null,null,null,null,null,null,null,null,null,null,null,null,null,null,null,null,null,null,null,null,null,null,null,null,null,null,null,null,null,null,null,null,null,null,null,null,null,null,null,null,null,null,null,null,null,null,null,null,null,null,null,null,"Zweibrücken","425"]
[null,null,null,null,null,null,null,null,null,null,null,null,null,null,null,null,null,null,null,null,null,null,null,null,null,null,null,null,null,null,null,null,null,null,null,null,null,null,null,null,null,null,null,null,null,null,null,null,null,null,null,null,null,null,null,null,null,null,null,null,null,null,null,"Zwickau","426"]
[null,null,null,null,null,null,null,null,null,null,null,null,null,null,null,null,null,null,null,null,null,null,null,null,null,null,null,null,null,null,null,null,null,null,null,null,null,null,null,null,null,null,null,null,null,null,null,null,null,null,null,null,null,null,null,null,null,null,null,null,null,null,null,"Zwiesel","427"]
[null,null,null,null,null,null,null,null,null,null,null,null,null,null,null,null,null,null,null,null,null,null,null,null,null,null,null,null,null,null,null,null,null,null,null,null,null,null,null,null,null,null,null,null,null,null,null,null,null,null,null,null,null,null,null,null,null,null,null,null,null,null,null,"unbekannt","428"]
[null,null,null,null,null,null,null,null,null,null,null,null,null,null,null,null,null,null,null,null,null,null,null,null,null,null,null,null,null,null,null,null,null,null,null,null,null,null,null,null,null,null,null,null,null,null,null,null,null,null,null,null,null,null,null,null,null,null,null,null,null,null,null,"Berlin","429"]
[null,null,null,null,null,null,null,null,null,null,null,null,null,null,null,null,null,null,null,null,null,null,null,null,null,null,null,null,null,null,null,null,null,null,null,null,null,null,null,null,null,null,null,null,null,null,null,null,null,null,null,null,null,null,null,null,null,null,null,null,null,null,null,"Erding",430]
[null,null,null,null,null,null,null,null,null,null,null,null,null,null,null,null,null,null,null,null,null,null,null,null,null,null,null,null,null,null,null,null,null,null,null,null,null,null,null,null,null,null,null,null,null,null,null,null,null,null,null,null,null,null,null,null,null,null,null,null,null,null,null,"sonstige",431]
[null,null,null,null,null,null,null,null,null,null,null,null,null,null,null,null,null,null,null,null,null,null,null,null,null,null,null,null,null,null,null,null,null,null,null,null,null,null,null,null,null,null,null,null,null,null,null,null,null,null,null,null,null,null,null,null,null,null,null,null,null,null,null,"Ausland",432]
[null,null,null,null,null,null,null,null,null,null,null,null,null,null,null,null,null,null,null,null,null,null,null,null,null,null,null,null,null,null,null,null,null,null,null,null,null,null,null,null,null,null,null,null,null,null,null,null,null,null,null,null,null,null,null,null,null,null,null,null,null,null,null,"Bad-Cannstatt","19"]
[null,null,null,null,null,null,null,null,null,null,null,null,null,null,null,null,null,null,null,null,null,null,null,null,null,null,null,null,null,null,null,null,null,null,null,null,null,null,null,null,null,null,null,null,null,null,null,null,null,null,null,null,null,null,null,null,null,null,null,null,null,null,null,"Bad-Colberg","20"]
[null,null,null,null,null,null,null,null,null,null,null,null,null,null,null,null,null,null,null,null,null,null,null,null,null,null,null,null,null,null,null,null,null,null,null,null,null,null,null,null,null,null,null,null,null,null,null,null,null,null,null,null,null,null,null,null,null,null,null,null,null,null,null,"Bad-Driburg","21"]
[null,null,null,null,null,null,null,null,null,null,null,null,null,null,null,null,null,null,null,null,null,null,null,null,null,null,null,null,null,null,null,null,null,null,null,null,null,null,null,null,null,null,null,null,null,null,null,null,null,null,null,null,null,null,null,null,null,null,null,null,null,null,null,"Bad-Harzburg","22"]
[null,null,null,null,null,null,null,null,null,null,null,null,null,null,null,null,null,null,null,null,null,null,null,null,null,null,null,null,null,null,null,null,null,null,null,null,null,null,null,null,null,null,null,null,null,null,null,null,null,null,null,null,null,null,null,null,null,null,null,null,null,null,null,"Bad-Hersfeld","23"]
[null,null,null,null,null,null,null,null,null,null,null,null,null,null,null,null,null,null,null,null,null,null,null,null,null,null,null,null,null,null,null,null,null,null,null,null,null,null,null,null,null,null,null,null,null,null,null,null,null,null,null,null,null,null,null,null,null,null,null,null,null,null,null,"Bad-Hindelang","24"]
[null,null,null,null,null,null,null,null,null,null,null,null,null,null,null,null,null,null,null,null,null,null,null,null,null,null,null,null,null,null,null,null,null,null,null,null,null,null,null,null,null,null,null,null,null,null,null,null,null,null,null,null,null,null,null,null,null,null,null,null,null,null,null,"Bad-Homburg","25"]
[null,null,null,null,null,null,null,null,null,null,null,null,null,null,null,null,null,null,null,null,null,null,null,null,null,null,null,null,null,null,null,null,null,null,null,null,null,null,null,null,null,null,null,null,null,null,null,null,null,null,null,null,null,null,null,null,null,null,null,null,null,null,null,"Bad-Honnef","26"]
[null,null,null,null,null,null,null,null,null,null,null,null,null,null,null,null,null,null,null,null,null,null,null,null,null,null,null,null,null,null,null,null,null,null,null,null,null,null,null,null,null,null,null,null,null,null,null,null,null,null,null,null,null,null,null,null,null,null,null,null,null,null,null,"Bad-Iburg","27"]
[null,null,null,null,null,null,null,null,null,null,null,null,null,null,null,null,null,null,null,null,null,null,null,null,null,null,null,null,null,null,null,null,null,null,null,null,null,null,null,null,null,null,null,null,null,null,null,null,null,null,null,null,null,null,null,null,null,null,null,null,null,null,null,"Bad-Malente","28"]
[null,null,null,null,null,null,null,null,null,null,null,null,null,null,null,null,null,null,null,null,null,null,null,null,null,null,null,null,null,null,null,null,null,null,null,null,null,null,null,null,null,null,null,null,null,null,null,null,null,null,null,null,null,null,null,null,null,null,null,null,null,null,null,"Bad-Mergentheim","29"]
[null,null,null,null,null,null,null,null,null,null,null,null,null,null,null,null,null,null,null,null,null,null,null,null,null,null,null,null,null,null,null,null,null,null,null,null,null,null,null,null,null,null,null,null,null,null,null,null,null,null,null,null,null,null,null,null,null,null,null,null,null,null,null,"Bad-Nauheim","30"]
[null,null,null,null,null,null,null,null,null,null,null,null,null,null,null,null,null,null,null,null,null,null,null,null,null,null,null,null,null,null,null,null,null,null,null,null,null,null,null,null,null,null,null,null,null,null,null,null,null,null,null,null,null,null,null,null,null,null,null,null,null,null,null,"Bad-Oldesloe","31"]
[null,null,null,null,null,null,null,null,null,null,null,null,null,null,null,null,null,null,null,null,null,null,null,null,null,null,null,null,null,null,null,null,null,null,null,null,null,null,null,null,null,null,null,null,null,null,null,null,null,null,null,null,null,null,null,null,null,null,null,null,null,null,null,"Bad-Schmiedeberg","32"]
[null,null,null,null,null,null,null,null,null,null,null,null,null,null,null,null,null,null,null,null,null,null,null,null,null,null,null,null,null,null,null,null,null,null,null,null,null,null,null,null,null,null,null,null,null,null,null,null,null,null,null,null,null,null,null,null,null,null,null,null,null,null,null,"Bad-Soden","33"]
[null,null,null,null,null,null,null,null,null,null,null,null,null,null,null,null,null,null,null,null,null,null,null,null,null,null,null,null,null,null,null,null,null,null,null,null,null,null,null,null,null,null,null,null,null,null,null,null,null,null,null,null,null,null,null,null,null,null,null,null,null,null,null,"Bad-Streben","34"]
[null,null,null,null,null,null,null,null,null,null,null,null,null,null,null,null,null,null,null,null,null,null,null,null,null,null,null,null,null,null,null,null,null,null,null,null,null,null,null,null,null,null,null,null,null,null,null,null,null,null,null,null,null,null,null,null,null,null,null,null,null,null,null,"Bad-Waldliesborn","35"]
[null,null,null,null,null,null,null,null,null,null,null,null,null,null,null,null,null,null,null,null,null,null,null,null,null,null,null,null,null,null,null,null,null,null,null,null,null,null,null,null,null,null,null,null,null,null,null,null,null,null,null,null,null,null,null,null,null,null,null,null,null,null,null,"Bad-Waldsee","36"]
[null,null,null,null,null,null,null,null,null,null,null,null,null,null,null,null,null,null,null,null,null,null,null,null,null,null,null,null,null,null,null,null,null,null,null,null,null,null,null,null,null,null,null,null,null,null,null,null,null,null,null,null,null,null,null,null,null,null,null,null,null,null,null,"Bergisch-Gladbach","46"]
[null,null,null,null,null,null,null,null,null,null,null,null,null,null,null,null,null,null,null,null,null,null,null,null,null,null,null,null,null,null,null,null,null,null,null,null,null,null,null,null,null,null,null,null,null,null,null,null,null,null,null,null,null,null,null,null,null,null,null,null,null,null,null,"Sankt-Augustin","343"]
[null,null,null,null,null,null,null,null,null,null,null,null,null,null,null,null,null,null,null,null,null,null,null,null,null,null,null,null,null,null,null,null,null,null,null,null,null,null,null,null,null,null,null,null,null,null,null,null,null,null,null,null,null,null,null,null,null,null,null,null,null,null,null,"Schwäbisch-Gmünd","347"]
[null,null,null,null,null,null,null,null,null,null,null,null,null,null,null,null,null,null,null,null,null,null,null,null,null,null,null,null,null,null,null,null,null,null,null,null,null,null,null,null,null,null,null,null,null,null,null,null,null,null,null,null,null,null,null,null,null,null,null,null,null,null,null,"Schwäbisch-Hall","348"]
[null,null,null,null,null,null,null,null,null,null,null,null,null,null,null,null,null,null,null,null,null,null,null,null,null,null,null,null,null,null,null,null,null,null,null,null,null,null,null,null,null,null,null,null,null,null,null,null,null,null,null,null,null,null,null,null,null,null,null,null,null,null,null,"St.-Gallen","359"]
[null,null,null,null,null,null,null,null,null,null,null,null,null,null,null,null,null,null,null,null,null,null,null,null,null,null,null,null,null,null,null,null,null,null,null,null,null,null,null,null,null,null,null,null,null,null,null,null,null,null,null,null,null,null,null,null,null,null,null,null,null,null,null,"St.-Pölten","360"]
[null,null,null,null,null,null,null,null,null,null,null,null,null,null,null,null,null,null,null,null,null,null,null,null,null,null,null,null,null,null,null,null,null,null,null,null,null,null,null,null,null,null,null,null,null,null,null,null,null,null,null,null,null,null,null,null,null,null,null,null,null,null,null,"Boeblingen","57"]
[null,null,null,null,null,null,null,null,null,null,null,null,null,null,null,null,null,null,null,null,null,null,null,null,null,null,null,null,null,null,null,null,null,null,null,null,null,null,null,null,null,null,null,null,null,null,null,null,null,null,null,null,null,null,null,null,null,null,null,null,null,null,null,"Duenkeloh","107"]
[null,null,null,null,null,null,null,null,null,null,null,null,null,null,null,null,null,null,null,null,null,null,null,null,null,null,null,null,null,null,null,null,null,null,null,null,null,null,null,null,null,null,null,null,null,null,null,null,null,null,null,null,null,null,null,null,null,null,null,null,null,null,null,"Dueren","108"]
[null,null,null,null,null,null,null,null,null,null,null,null,null,null,null,null,null,null,null,null,null,null,null,null,null,null,null,null,null,null,null,null,null,null,null,null,null,null,null,null,null,null,null,null,null,null,null,null,null,null,null,null,null,null,null,null,null,null,null,null,null,null,null,"Duesseldorf","109"]
[null,null,null,null,null,null,null,null,null,null,null,null,null,null,null,null,null,null,null,null,null,null,null,null,null,null,null,null,null,null,null,null,null,null,null,null,null,null,null,null,null,null,null,null,null,null,null,null,null,null,null,null,null,null,null,null,null,null,null,null,null,null,null,"Eckernfoerde","111"]
[null,null,null,null,null,null,null,null,null,null,null,null,null,null,null,null,null,null,null,null,null,null,null,null,null,null,null,null,null,null,null,null,null,null,null,null,null,null,null,null,null,null,null,null,null,null,null,null,null,null,null,null,null,null,null,null,null,null,null,null,null,null,null,"Eichstaett","113"]
[null,null,null,null,null,null,null,null,null,null,null,null,null,null,null,null,null,null,null,null,null,null,null,null,null,null,null,null,null,null,null,null,null,null,null,null,null,null,null,null,null,null,null,null,null,null,null,null,null,null,null,null,null,null,null,null,null,null,null,null,null,null,null,"Gaissach","144"]
[null,null,null,null,null,null,null,null,null,null,null,null,null,null,null,null,null,null,null,null,null,null,null,null,null,null,null,null,null,null,null,null,null,null,null,null,null,null,null,null,null,null,null,null,null,null,null,null,null,null,null,null,null,null,null,null,null,null,null,null,null,null,null,"Giessen","155"]
[null,null,null,null,null,null,null,null,null,null,null,null,null,null,null,null,null,null,null,null,null,null,null,null,null,null,null,null,null,null,null,null,null,null,null,null,null,null,null,null,null,null,null,null,null,null,null,null,null,null,null,null,null,null,null,null,null,null,null,null,null,null,null,"Goeppingen","158"]
[null,null,null,null,null,null,null,null,null,null,null,null,null,null,null,null,null,null,null,null,null,null,null,null,null,null,null,null,null,null,null,null,null,null,null,null,null,null,null,null,null,null,null,null,null,null,null,null,null,null,null,null,null,null,null,null,null,null,null,null,null,null,null,"Goettingen","160"]
[null,null,null,null,null,null,null,null,null,null,null,null,null,null,null,null,null,null,null,null,null,null,null,null,null,null,null,null,null,null,null,null,null,null,null,null,null,null,null,null,null,null,null,null,null,null,null,null,null,null,null,null,null,null,null,null,null,null,null,null,null,null,null,"Guestrow","169"]
[null,null,null,null,null,null,null,null,null,null,null,null,null,null,null,null,null,null,null,null,null,null,null,null,null,null,null,null,null,null,null,null,null,null,null,null,null,null,null,null,null,null,null,null,null,null,null,null,null,null,null,null,null,null,null,null,null,null,null,null,null,null,null,"Hoehr","194"]
[null,null,null,null,null,null,null,null,null,null,null,null,null,null,null,null,null,null,null,null,null,null,null,null,null,null,null,null,null,null,null,null,null,null,null,null,null,null,null,null,null,null,null,null,null,null,null,null,null,null,null,null,null,null,null,null,null,null,null,null,null,null,null,"Hoexter","198"]
[null,null,null,null,null,null,null,null,null,null,null,null,null,null,null,null,null,null,null,null,null,null,null,null,null,null,null,null,null,null,null,null,null,null,null,null,null,null,null,null,null,null,null,null,null,null,null,null,null,null,null,null,null,null,null,null,null,null,null,null,null,null,null,"Juelich","209"]
[null,null,null,null,null,null,null,null,null,null,null,null,null,null,null,null,null,null,null,null,null,null,null,null,null,null,null,null,null,null,null,null,null,null,null,null,null,null,null,null,null,null,null,null,null,null,null,null,null,null,null,null,null,null,null,null,null,null,null,null,null,null,null,"Koeln","221"]
[null,null,null,null,null,null,null,null,null,null,null,null,null,null,null,null,null,null,null,null,null,null,null,null,null,null,null,null,null,null,null,null,null,null,null,null,null,null,null,null,null,null,null,null,null,null,null,null,null,null,null,null,null,null,null,null,null,null,null,null,null,null,null,"Koethen","223"]
[null,null,null,null,null,null,null,null,null,null,null,null,null,null,null,null,null,null,null,null,null,null,null,null,null,null,null,null,null,null,null,null,null,null,null,null,null,null,null,null,null,null,null,null,null,null,null,null,null,null,null,null,null,null,null,null,null,null,null,null,null,null,null,"Kuenzelsau","228"]
[null,null,null,null,null,null,null,null,null,null,null,null,null,null,null,null,null,null,null,null,null,null,null,null,null,null,null,null,null,null,null,null,null,null,null,null,null,null,null,null,null,null,null,null,null,null,null,null,null,null,null,null,null,null,null,null,null,null,null,null,null,null,null,"Loerrach","257"]
[null,null,null,null,null,null,null,null,null,null,null,null,null,null,null,null,null,null,null,null,null,null,null,null,null,null,null,null,null,null,null,null,null,null,null,null,null,null,null,null,null,null,null,null,null,null,null,null,null,null,null,null,null,null,null,null,null,null,null,null,null,null,null,"Luebeck","258"]
[null,null,null,null,null,null,null,null,null,null,null,null,null,null,null,null,null,null,null,null,null,null,null,null,null,null,null,null,null,null,null,null,null,null,null,null,null,null,null,null,null,null,null,null,null,null,null,null,null,null,null,null,null,null,null,null,null,null,null,null,null,null,null,"Luedenscheid","259"]
[null,null,null,null,null,null,null,null,null,null,null,null,null,null,null,null,null,null,null,null,null,null,null,null,null,null,null,null,null,null,null,null,null,null,null,null,null,null,null,null,null,null,null,null,null,null,null,null,null,null,null,null,null,null,null,null,null,null,null,null,null,null,null,"Lueneburg","263"]
[null,null,null,null,null,null,null,null,null,null,null,null,null,null,null,null,null,null,null,null,null,null,null,null,null,null,null,null,null,null,null,null,null,null,null,null,null,null,null,null,null,null,null,null,null,null,null,null,null,null,null,null,null,null,null,null,null,null,null,null,null,null,null,"Moenchengladbach","281"]
[null,null,null,null,null,null,null,null,null,null,null,null,null,null,null,null,null,null,null,null,null,null,null,null,null,null,null,null,null,null,null,null,null,null,null,null,null,null,null,null,null,null,null,null,null,null,null,null,null,null,null,null,null,null,null,null,null,null,null,null,null,null,null,"Muelheim","283"]
[null,null,null,null,null,null,null,null,null,null,null,null,null,null,null,null,null,null,null,null,null,null,null,null,null,null,null,null,null,null,null,null,null,null,null,null,null,null,null,null,null,null,null,null,null,null,null,null,null,null,null,null,null,null,null,null,null,null,null,null,null,null,null,"Muenchberg","284"]
[null,null,null,null,null,null,null,null,null,null,null,null,null,null,null,null,null,null,null,null,null,null,null,null,null,null,null,null,null,null,null,null,null,null,null,null,null,null,null,null,null,null,null,null,null,null,null,null,null,null,null,null,null,null,null,null,null,null,null,null,null,null,null,"Muenchen","285"]
[null,null,null,null,null,null,null,null,null,null,null,null,null,null,null,null,null,null,null,null,null,null,null,null,null,null,null,null,null,null,null,null,null,null,null,null,null,null,null,null,null,null,null,null,null,null,null,null,null,null,null,null,null,null,null,null,null,null,null,null,null,null,null,"Muenster","286"]
[null,null,null,null,null,null,null,null,null,null,null,null,null,null,null,null,null,null,null,null,null,null,null,null,null,null,null,null,null,null,null,null,null,null,null,null,null,null,null,null,null,null,null,null,null,null,null,null,null,null,null,null,null,null,null,null,null,null,null,null,null,null,null,"Nuernberg","298"]
[null,null,null,null,null,null,null,null,null,null,null,null,null,null,null,null,null,null,null,null,null,null,null,null,null,null,null,null,null,null,null,null,null,null,null,null,null,null,null,null,null,null,null,null,null,null,null,null,null,null,null,null,null,null,null,null,null,null,null,null,null,null,null,"Nuertingen","299"]
[null,null,null,null,null,null,null,null,null,null,null,null,null,null,null,null,null,null,null,null,null,null,null,null,null,null,null,null,null,null,null,null,null,null,null,null,null,null,null,null,null,null,null,null,null,null,null,null,null,null,null,null,null,null,null,null,null,null,null,null,null,null,null,"Osnabrueck","308"]
[null,null,null,null,null,null,null,null,null,null,null,null,null,null,null,null,null,null,null,null,null,null,null,null,null,null,null,null,null,null,null,null,null,null,null,null,null,null,null,null,null,null,null,null,null,null,null,null,null,null,null,null,null,null,null,null,null,null,null,null,null,null,null,"Roedermark","332"]
[null,null,null,null,null,null,null,null,null,null,null,null,null,null,null,null,null,null,null,null,null,null,null,null,null,null,null,null,null,null,null,null,null,null,null,null,null,null,null,null,null,null,null,null,null,null,null,null,null,null,null,null,null,null,null,null,null,null,null,null,null,null,null,"Ruesselsheim","338"]
[null,null,null,null,null,null,null,null,null,null,null,null,null,null,null,null,null,null,null,null,null,null,null,null,null,null,null,null,null,null,null,null,null,null,null,null,null,null,null,null,null,null,null,null,null,null,null,null,null,null,null,null,null,null,null,null,null,null,null,null,null,null,null,"Saarbruecken","339"]
[null,null,null,null,null,null,null,null,null,null,null,null,null,null,null,null,null,null,null,null,null,null,null,null,null,null,null,null,null,null,null,null,null,null,null,null,null,null,null,null,null,null,null,null,null,null,null,null,null,null,null,null,null,null,null,null,null,null,null,null,null,null,null,"Schoenau","346"]
[null,null,null,null,null,null,null,null,null,null,null,null,null,null,null,null,null,null,null,null,null,null,null,null,null,null,null,null,null,null,null,null,null,null,null,null,null,null,null,null,null,null,null,null,null,null,null,null,null,null,null,null,null,null,null,null,null,null,null,null,null,null,null,"Schwaebisch Gmuend","347"]
[null,null,null,null,null,null,null,null,null,null,null,null,null,null,null,null,null,null,null,null,null,null,null,null,null,null,null,null,null,null,null,null,null,null,null,null,null,null,null,null,null,null,null,null,null,null,null,null,null,null,null,null,null,null,null,null,null,null,null,null,null,null,null,"Schwaebisch Hall","348"]
[null,null,null,null,null,null,null,null,null,null,null,null,null,null,null,null,null,null,null,null,null,null,null,null,null,null,null,null,null,null,null,null,null,null,null,null,null,null,null,null,null,null,null,null,null,null,null,null,null,null,null,null,null,null,null,null,null,null,null,null,null,null,null,"St. Poelten","360"]
[null,null,null,null,null,null,null,null,null,null,null,null,null,null,null,null,null,null,null,null,null,null,null,null,null,null,null,null,null,null,null,null,null,null,null,null,null,null,null,null,null,null,null,null,null,null,null,null,null,null,null,null,null,null,null,null,null,null,null,null,null,null,null,"Tuebingen","373"]
[null,null,null,null,null,null,null,null,null,null,null,null,null,null,null,null,null,null,null,null,null,null,null,null,null,null,null,null,null,null,null,null,null,null,null,null,null,null,null,null,null,null,null,null,null,null,null,null,null,null,null,null,null,null,null,null,null,null,null,null,null,null,null,"WaedenswilI","389"]
[null,null,null,null,null,null,null,null,null,null,null,null,null,null,null,null,null,null,null,null,null,null,null,null,null,null,null,null,null,null,null,null,null,null,null,null,null,null,null,null,null,null,null,null,null,null,null,null,null,null,null,null,null,null,null,null,null,null,null,null,null,null,null,"Warnemuende","393"]
[null,null,null,null,null,null,null,null,null,null,null,null,null,null,null,null,null,null,null,null,null,null,null,null,null,null,null,null,null,null,null,null,null,null,null,null,null,null,null,null,null,null,null,null,null,null,null,null,null,null,null,null,null,null,null,null,null,null,null,null,null,null,null,"Wolfenbuettel","416"]
[null,null,null,null,null,null,null,null,null,null,null,null,null,null,null,null,null,null,null,null,null,null,null,null,null,null,null,null,null,null,null,null,null,null,null,null,null,null,null,null,null,null,null,null,null,null,null,null,null,null,null,null,null,null,null,null,null,null,null,null,null,null,null,"Wuennen","418"]
[null,null,null,null,null,null,null,null,null,null,null,null,null,null,null,null,null,null,null,null,null,null,null,null,null,null,null,null,null,null,null,null,null,null,null,null,null,null,null,null,null,null,null,null,null,null,null,null,null,null,null,null,null,null,null,null,null,null,null,null,null,null,null,"Wuerzburg","420"]
[null,null,null,null,null,null,null,null,null,null,null,null,null,null,null,null,null,null,null,null,null,null,null,null,null,null,null,null,null,null,null,null,null,null,null,null,null,null,null,null,null,null,null,null,null,null,null,null,null,null,null,null,null,null,null,null,null,null,null,null,null,null,null,"Zuerich","424"]
[null,null,null,null,null,null,null,null,null,null,null,null,null,null,null,null,null,null,null,null,null,null,null,null,null,null,null,null,null,null,null,null,null,null,null,null,null,null,null,null,null,null,null,null,null,null,null,null,null,null,null,null,null,null,null,null,null,null,null,null,null,null,null,"Zweibruecken","425"]
[null,null,null,null,null,null,null,null,null,null,null,null,null,null,null,null,null,null,null,null,null,null,null,null,null,null,null,null,null,null,null,null,null,null,null,null,null,null,null,null,null,null,null,null,null,null,null,null,null,null,null,null,null,null,null,null,null,null,null,null,null,null,null,"Schwaebisch-Gmuend","347"]
[null,null,null,null,null,null,null,null,null,null,null,null,null,null,null,null,null,null,null,null,null,null,null,null,null,null,null,null,null,null,null,null,null,null,null,null,null,null,null,null,null,null,null,null,null,null,null,null,null,null,null,null,null,null,null,null,null,null,null,null,null,null,null,"Schwaebisch-Hall","348"]
[null,null,null,null,null,null,null,null,null,null,null,null,null,null,null,null,null,null,null,null,null,null,null,null,null,null,null,null,null,null,null,null,null,null,null,null,null,null,null,null,null,null,null,null,null,null,null,null,null,null,null,null,null,null,null,null,null,null,null,null,null,null,null,"St.-Poelten","360"]